1,3-Butanediol, (R)-
- Formula: C4H10O2
- Molecular weight: 90.1210
- IUPAC Standard InChIKey: PUPZLCDOIYMWBV-BYPYZUCNSA-N
- CAS Registry Number: 6290-03-5
- Chemical structure:
View 3d structure (requires JavaScript / HTML 5) - Stereoisomers:
- Other names: (R)-(-)-butane-1,3-diol

Phase change data

Data compiled as indicated in comments:
BS - Robert L. Brown and Stephen E. Stein
AC - William E. Acree, Jr., James S. Chickos
Quantity | Value | Units | Method | Reference | Comment |
---|---|---|---|---|---|
ΔvapH° | 72.3 ± 0.7 | kJ/mol | C | Ermelinda Eusébio, Lopes Jesus, et al., 2003 | AC |
Reduced pressure boiling point
Tboil (K) | Pressure (bar) | Reference | Comment |
---|---|---|---|
381.7 | 0.031 | Weast and Grasselli, 1989 | BS |

References

Ermelinda Eusébio, Lopes Jesus, et al., 2003
Ermelinda Eusébio, M.; Lopes Jesus, A.J.; Cruz, Mafalda S.C.; Leitão, M. Luisa P.; Simões Redinha, J.,
Enthalpy of vaporisation of butanediol isomers,
The Journal of Chemical Thermodynamics, 2003, 35, 1, 123-129, https://doi.org/10.1016/S0021-9614(02)00306-3
. [all data]
Weast and Grasselli, 1989
CRC Handbook of Data on Organic Compounds, 2nd Editon, Weast,R.C and Grasselli, J.G., ed(s)., CRC Press, Inc., Boca Raton, FL, 1989, 1. [all data]