2-Nonanol
- Formula: C9H20O
- Molecular weight: 144.2545
- IUPAC Standard InChIKey: NGDNVOAEIVQRFH-UHFFFAOYSA-N
- CAS Registry Number: 628-99-9
- Chemical structure:
View 3d structure (requires JavaScript / HTML 5) - Stereoisomers:
- Other names: Nonanol-(2); NONAN-2-OL; 1-Methyl-1-octanol; n-Nonan-2-ol

Phase change data

Data compiled as indicated in comments:
BS - Robert L. Brown and Stephen E. Stein
TRC - Thermodynamics Research Center, NIST Boulder Laboratories, Chris Muzny director
AC - William E. Acree, Jr., James S. Chickos
Quantity | Value | Units | Method | Reference | Comment |
---|---|---|---|---|---|
Tboil | 469. ± 5. | K | AVG | N/A | Average of 11 values; Individual data points |
Quantity | Value | Units | Method | Reference | Comment |
Tc | 650. ± 1. | K | N/A | Gude and Teja, 1995 | |
Tc | 650.1 | K | N/A | Rosenthal and Teja, 1990 | Uncertainty assigned by TRC = 0.6 K; TRC |
Tc | 650.1 | K | N/A | Rosenthal and Teja, 1989 | Uncertainty assigned by TRC = 0.6 K; TRC |
Tc | 649.5 | K | N/A | Teja, Lee, et al., 1989 | TRC |
Tc | 649.1 | K | N/A | Anselme and Teja, 1988 | Uncertainty assigned by TRC = 0.3 K; TRC |
Quantity | Value | Units | Method | Reference | Comment |
Pc | 25.3 ± 0.5 | bar | N/A | Gude and Teja, 1995 | |
Pc | 25.30 | bar | N/A | Rosenthal and Teja, 1990 | Uncertainty assigned by TRC = 0.20 bar; TRC |
Pc | 25.30 | bar | N/A | Rosenthal and Teja, 1989 | Uncertainty assigned by TRC = 0.20 bar; TRC |
Quantity | Value | Units | Method | Reference | Comment |
Vc | 0.575 | l/mol | N/A | Gude and Teja, 1995 | |
Quantity | Value | Units | Method | Reference | Comment |
ρc | 1.74 ± 0.05 | mol/l | N/A | Gude and Teja, 1995 | |
ρc | 1.74 | mol/l | N/A | Anselme and Teja, 1988 | Uncertainty assigned by TRC = 0.04 mol/l; TRC |
Quantity | Value | Units | Method | Reference | Comment |
ΔvapH° | 72.9 ± 0.6 | kJ/mol | GS | Verevkin and Schick, 2007 | Based on data from 286. to 324. K.; AC |
Enthalpy of vaporization
ΔvapH (kJ/mol) | Temperature (K) | Reference | Comment |
---|---|---|---|
79.6 | 268. | N'Guimbi, Berro, et al., 1999 | Based on data from 253. to 353. K.; AC |
55.5 | 379. | Wilhoit and Zwolinski, 1973 | Based on data from 364. to 471. K.; AC |

Van Den Dool and Kratz RI, polar column, custom temperature program

Data compiled by: NIST Mass Spectrometry Data Center, William E. Wallace, director

Column type CapillaryCapillaryCapillaryCapillaryCapillary
Active phase Supelcowax-10Supelcowax-10DB-WaxStabilwaxCP-Wax 52CB
Column length (m) 30.30.60.30.60.
Carrier gas HeHeHeHeHe
Substrate
Column diameter (mm) 0.250.250.250.320.25
Phase thickness (μm) 0.250.250.251.0.25
Program 35C(8min) => 4C/min => 60C => 6C/min => 160C => 20C/min => 200C(1min)40C(1min) => 10C/min => 120C => 15C/min => 200C (1min)35C(0.7min) => 20C/min => 70C => 4C/min => 240C40C (2min) => 5C/min => 100C => 4C/min => 230C (10min)45C(5min) => 10C/min => 80C => 2C/min => 240C
I 1528.1528.1509.1535.1515.
ReferenceBianchi, Careri, et al., 2007Bianchi, Careri, et al., 2007Ferrari, Lablanquie, et al., 2004Klesk, Qian, et al., 2004Verzera, Ziino, et al., 2004
Comment MSDC-RI MSDC-RI MSDC-RI MSDC-RI MSDC-RI
Column type CapillaryCapillaryCapillaryCapillary
Active phase DB-WaxDB-WaxDB-WaxDB-Wax
Column length (m) 30.30.30.30.
Carrier gas HeHeHeHe
Substrate
Column diameter (mm) 0.320.320.320.32
Phase thickness (μm) 0.50.50.50.5
Program 50C => 6C/min => 70C => 4C/min => 150C => 10C/min => 250C50C => 6C/min => 70C => 4C/min => 150C => 10C/min => 250C50C => 5C/min => 180C => 10C/min => 250C50C => 5C/min => 180C => 10C/min => 250C
I 1535.1535.1535.1537.
ReferencePennarun, Prost, et al., 2003Pennarun, Prost, et al., 2002Sérot, Regost, et al., 2002Sérot, Regost, et al., 2001
Comment MSDC-RI MSDC-RI MSDC-RI MSDC-RI

Kovats' RI, non-polar column, temperature ramp

Data compiled by: NIST Mass Spectrometry Data Center, William E. Wallace, director

Column type CapillaryCapillary
Active phase BP-1Methyl Silicone
Column length (m) 25.12.
Carrier gas N2
Substrate
Column diameter (mm) 0.550.5
Phase thickness (μm) 0.25
Tstart (C) 60.70.
Tend (C) 220.250.
Heat rate (K/min) 5.4.
Initial hold (min)
Final hold (min) 15.15.
I 1092.1108.7
ReferenceRaina, Srivastava, et al., 2002Rao, Rajanikanth, et al., 1989
Comment MSDC-RI MSDC-RI

References

Gude and Teja, 1995
Gude, M.; Teja, A.S.,
Vapor-Liquid Critical Properties of Elements and Compounds. 4. Aliphatic Alkanols,
J. Chem. Eng. Data, 1995, 40, 1025-1036. [all data]
Rosenthal and Teja, 1990
Rosenthal, D.J.; Teja, A.S.,
The Critical Pressures and temperatures of Isomeric Alkanols,
Ind. Eng. Chem. to be published 1990 1990, 1990. [all data]
Rosenthal and Teja, 1989
Rosenthal, D.J.; Teja, A.S.,
Critical pressures and temperatures of isomeric alkanols,
Ind. Eng. Chem. Res., 1989, 28, 1693. [all data]
Teja, Lee, et al., 1989
Teja, A.S.; Lee, R.J.; Rosenthal, D.J.; Anselme, M.J.,
Correlation of the Critical Properties of Alkanes and Alkanols
in 5th IUPAC Conference on Alkanes and AlkanolsGradisca, 1989. [all data]
Anselme and Teja, 1988
Anselme, M.J.; Teja, A.S.,
Critical Temperatures and Densities of Isomeric Alkanols with Six to Ten Carbon Atoms,
Fluid Phase Equilib., 1988, 40, 127-34. [all data]
Verevkin and Schick, 2007
Verevkin, Sergey P.; Schick, Christoph,
Vapour pressures and heat capacity measurements on the C7--C9 secondary aliphatic alcohols,
The Journal of Chemical Thermodynamics, 2007, 39, 5, 758-766, https://doi.org/10.1016/j.jct.2006.10.007
. [all data]
N'Guimbi, Berro, et al., 1999
N'Guimbi, J.; Berro, C.; Mokbel, I.; Rauzy, E.; Jose, J.,
Experimental vapour pressures of 13 secondary and tertiary alcohols---correlation and prediction by a group contribution method,
Fluid Phase Equilibria, 1999, 162, 1-2, 143-158, https://doi.org/10.1016/S0378-3812(99)00168-5
. [all data]
Wilhoit and Zwolinski, 1973
Wilhoit, R.C.; Zwolinski, B.J.,
Physical and thermodynamic properties of aliphatic alcohols,
J. Phys. Chem. Ref. Data Suppl., 1973, 1, 2, 1. [all data]