Ethylene glycol, dinitrate
- Formula: C2H4N2O6
- Molecular weight: 152.0630
- IUPAC Standard InChIKey: UQXKXGWGFRWILX-UHFFFAOYSA-N
- CAS Registry Number: 628-96-6
- Chemical structure:
View 3d structure (requires JavaScript / HTML 5) - Other names: 1,2-Ethanediol, dinitrate; Ethylene dinitrate; Ethylene nitrate; EGDN; Glycol dinitrate; Nitroglycol; Dinitroglicol; Dinitroglycol; Ethanediol dinitrate; Ethylenglykoldinitrat; Glycoldinitraat; Glykoldinitrat; Nitroglykol; 1,2-Ethanediol, 1,2-dinitrate

Condensed phase thermochemistry data

Data compiled by: Hussein Y. Afeefy, Joel F. Liebman, and Stephen E. Stein
Quantity | Value | Units | Method | Reference | Comment |
---|---|---|---|---|---|
ΔfH°liquid | -233. | kJ/mol | Ccb | Rinkenbach, 1926 | |
Quantity | Value | Units | Method | Reference | Comment |
ΔcH°liquid | -1123.3 | kJ/mol | Ccb | Rinkenbach, 1926 |

Phase change data

Data compiled by: William E. Acree, Jr., James S. Chickos
Quantity | Value | Units | Method | Reference | Comment |
---|---|---|---|---|---|
ΔvapH° | 70.5 | kJ/mol | A | Stephenson and Malanowski, 1987 | Based on data from 283. to 535. K. |
Quantity | Value | Units | Method | Reference | Comment |
ΔsubH° | 103.8 | kJ/mol | TE,ME | Nunez, Barral, et al., 1988 |
Enthalpy of vaporization
ΔvapH (kJ/mol) | Temperature (K) | Method | Reference | Comment |
---|---|---|---|---|
55.3 | 358. | A | Stephenson and Malanowski, 1987 | Based on data from 343. to 465. K. |
68.3 | 255. | N/A | Stephenson and Malanowski, 1987 | Based on data from 240. to 298. K. See also Pella, 1977. |
62.3 ± 0.4 | 278. to 390. | N/A | Belyaev, 1941 | |
68.6 ± 0.4 | 293. to 323. | N/A | Brander, 1938 |
Enthalpy of sublimation
ΔsubH (kJ/mol) | Temperature (K) | Method | Reference | Comment |
---|---|---|---|---|
105.1 | 361. | TE,ME | De Wit, Van Miltenburg, et al., 1983 | Based on data from 345. to 372. K. |
105.4 | 369. | ME | Bradley and Cleasby, 1953 | Based on data from 360. to 378. K. See also Jones, 1960 and Stephenson and Malanowski, 1987. |

Kovats' RI, non-polar column, isothermal

Column type | Active phase | Temperature (C) | I | Reference | Comment |
---|---|---|---|---|---|
Capillary | DB-5 | 140. | 1034.50 | Hobbs and Conde, 1992 | 30. m/0.25 mm/0.25 μm |
Capillary | DB-5 | 140. | 1050.99 | Hobbs and Conde, 1992 | 30. m/0.25 mm/0.25 μm |

Van Den Dool and Kratz RI, non-polar column, temperature ramp

Column type | Active phase | I | Reference | Comment |
---|---|---|---|---|
Capillary | DB-5 | 1032.05 | Hobbs and Conde, 1992 | 30. m/0.25 mm/0.25 μm, 5. K/min; Tstart: 40. C; Tend: 300. C |
Capillary | DB-5 | 1039.73 | Hobbs and Conde, 1992 | 30. m/0.25 mm/0.25 μm, 5. K/min; Tstart: 40. C; Tend: 300. C |

References

Rinkenbach, 1926
Rinkenbach, W.H.,
The properties of glycol dinitrate,
Ind. Eng. Chem., 1926, 18, 1195-1197. [all data]
Stephenson and Malanowski, 1987
Stephenson, Richard M.; Malanowski, Stanislaw,
Handbook of the Thermodynamics of Organic Compounds, 1987, https://doi.org/10.1007/978-94-009-3173-2
. [all data]
Nunez, Barral, et al., 1988
Nunez, L.; Barral, L.; Pilcher, G.,
Enthalpies of combustion of oxamic acid, oxamide, and dithiooxamide,
J. Chem. Thermodyn., 1988, 20, 1211-1216. [all data]
Pella, 1977
Pella, Peter A.,
Measurement of the vapor pressures of tnt, 2,4-dnt, 2,6-dnt, and egdn,
The Journal of Chemical Thermodynamics, 1977, 9, 4, 301-305, https://doi.org/10.1016/0021-9614(77)90049-0
. [all data]
Belyaev, 1941
Belyaev, A.F.,
Acta Physicochim. URSS, 1941, 14, 523. [all data]
Brander, 1938
Brander, J.D.,
Nitroglycerin and Ethylene Glycol Dinitrate Vapor Pressures of Binary Solutions,
Ind. Eng. Chem., 1938, 30, 6, 681-684, https://doi.org/10.1021/ie50342a015
. [all data]
De Wit, Van Miltenburg, et al., 1983
De Wit, H.G.M.; Van Miltenburg, J.C.; De Kruif, C.G.,
Thermodynamic properties of molecular organic crystals containing nitrogen, oxygen, and sulphur 1. Vapour pressures and enthalpies of sublimation,
The Journal of Chemical Thermodynamics, 1983, 15, 7, 651-663, https://doi.org/10.1016/0021-9614(83)90079-4
. [all data]
Bradley and Cleasby, 1953
Bradley, R.S.; Cleasby, T.G.,
346. The vapour pressure and lattice energy of hydrogen-bonded crystals. Part I. Oxamide, oxamic acid, and rubeanic acid,
J. Chem. Soc., 1953, 1681, https://doi.org/10.1039/jr9530001681
. [all data]
Jones, 1960
Jones, A.H.,
Sublimation Pressure Data for Organic Compounds.,
J. Chem. Eng. Data, 1960, 5, 2, 196-200, https://doi.org/10.1021/je60006a019
. [all data]
Hobbs and Conde, 1992
Hobbs, J.R.; Conde, E.P.,
Gas chromatographic retention indices of explosives and nitro-compounds
in Advances in Analysis and Detection of Explosives: Proceedings of the 4th International Symposium on Analysis of Detection of Explosives, September 7-10, 1992, Jerusalem Israel, J. Yinon, ed(s)., Kluwer Academic Publishers, Netherlands, 1992, 153-164. [all data]