Zinc, dipropyl-
- Formula: C6H14Zn
- Molecular weight: 151.56
- IUPAC Standard InChIKey: QQTGJVBUIOTPGZ-UHFFFAOYSA-N
- CAS Registry Number: 628-91-1
- Chemical structure:
View 3d structure (requires JavaScript / HTML 5) - Other names: Dipropyl zinc

Gas phase thermochemistry data

Data compiled by: José A. Martinho Simões
Quantity | Value | Units | Method | Reference | Comment |
---|---|---|---|---|---|
ΔfH°gas | -17. ± 23. | kJ/mol | Review | Martinho Simões |

Condensed phase thermochemistry data

Data compiled by: José A. Martinho Simões
Quantity | Value | Units | Method | Reference | Comment |
---|---|---|---|---|---|
ΔfH°liquid | -59. ± 23. | kJ/mol | Review | Martinho Simões | |
Quantity | Value | Units | Method | Reference | Comment |
ΔcH°liquid | -4653. ± 23. | kJ/mol | CC-SB | Long and Norrish, 1949 | Please also see Pedley and Rylance, 1977 and Cox and Pilcher, 1970. |

Phase change data

Data compiled as indicated in comments:
MS - José A. Martinho Simões
AC - William E. Acree, Jr., James S. Chickos
Quantity | Value | Units | Method | Reference | Comment |
---|---|---|---|---|---|
ΔvapH° | 42.1 ± 0.4 | kJ/mol | CC-SB | Sokolovskii and Baev, 1984 | Another value for the enthalpy of vaporization has been reported: 45.6 ± 2.5 kJ/mol Hatch, Sutherland, et al., 1949.; MS |
Enthalpy of vaporization
ΔvapH (kJ/mol) | Temperature (K) | Reference | Comment |
---|---|---|---|
42.1 ± 0.4 | 341. | Sokolovskii and Baev, 1984, 2 | Based on data from 313. to 370. K.; AC |

References

Martinho Simões
Martinho Simões, J.A.,
Private communication (see http://webbook.nist.gov/chemistry/om/). [all data]
Long and Norrish, 1949
Long, L.H.; Norrish, R.G.W.,
Phil. Trans. Roy. Soc. (London), 1949, A241, 587. [all data]
Pedley and Rylance, 1977
Pedley, J.B.; Rylance, J.,
Computer Analysed Thermochemical Data: Organic and Organometallic Compounds, University of Sussex, Brigton, 1977. [all data]
Cox and Pilcher, 1970
Cox, J.D.; Pilcher, G.,
Thermochemistry of Organic and Organometallic Compounds
in Academic Press, New York, 1970. [all data]
Sokolovskii and Baev, 1984
Sokolovskii, A.E.; Baev, A.K.,
Vestsi Akad. Navuk BSSR, Ser. Khim. Navuk, 1984, 115.. [all data]
Hatch, Sutherland, et al., 1949
Hatch, L.F.; Sutherland, G.; Ross, W.J.,
J. Org. Chem., 1949, 14, 1130. [all data]
Sokolovskii and Baev, 1984, 2
Sokolovskii, A.E.; Baev, A.K.,
Vestsi Akad. Navuk BSSR Ser. Khim. Navuk, 1984, 115. [all data]