2-Methoxy ethyl formate
- Formula: C4H8O3
- Molecular weight: 104.1045
- IUPAC Standard InChIKey: HVSACIINGLQLCS-UHFFFAOYSA-N
- CAS Registry Number: 628-82-0
- Chemical structure:
View 3d structure (requires JavaScript / HTML 5) - Permanent link for this species. Use this link for bookmarking this species for future reference.

Condensed phase thermochemistry data

Data compiled by: Hussein Y. Afeefy, Joel F. Liebman, and Stephen E. Stein
Quantity | Value | Units | Method | Reference | Comment |
---|---|---|---|---|---|
ΔfH°liquid | -565.3 ± 7.7 | kJ/mol | Cm | Guthrie, 1977 | Hydrolysis |

Phase change data

Data compiled by: Hussein Y. Afeefy, Joel F. Liebman, and Stephen E. Stein
Quantity | Value | Units | Method | Reference | Comment |
---|---|---|---|---|---|
ΔvapH° | 43.5 ± 4.2 | kJ/mol | E | Guthrie, 1977 | Hydrolysis |

References

Guthrie, 1977
Guthrie, J.P.,
Cyclization of glycol monoesters to give hemiorthoesters: a test of the thermochemical method for determining free energies of tetrahedral intermediates,
Can. J. Chem., 1977, 55, 3562-3574. [all data]