Ethanol, 2,2'-oxybis-, diacetate
- Formula: C8H14O5
- Molecular weight: 190.1938
- IUPAC Standard InChIKey: UBPGILLNMDGSDS-UHFFFAOYSA-N
- CAS Registry Number: 628-68-2
- Chemical structure:
View 3d structure (requires JavaScript / HTML 5) - Other names: Diethylene glycol, diacetate; Oxydiethylene acetate; Diglycol, diacetate; 2-(2-Acetyloxyethoxy)ethyl acetate; dioxyethylene glycol diacetate; oxydiethylene di(acetate)

Phase change data

Data compiled by: Robert L. Brown and Stephen E. Stein
Reduced pressure boiling point
Tboil (K) | Pressure (atm) | Reference |
---|---|---|
395.7 | 0.021 | Weast and Grasselli, 1989 |

Van Den Dool and Kratz RI, non-polar column, temperature ramp

Column type | Active phase | I | Reference | Comment |
---|---|---|---|---|
Capillary | HP-101 | 1303. | Politeo, Jukic, et al., 2007 | 25. m/0.2 mm/0.2 μm, He, 70. C @ 2. min, 3. K/min, 200. C @ 15. min |
Packed | SE-30 | 1281. | Gnauck, 1984 | N2, Chromosorb W AW DMCS, 10. K/min; Column length: 2. m; Tstart: 50. C |
Packed | SE-30 | 1278. | Gnauck, 1984 | N2, Chromosorb W AW DMCS, 4. K/min; Column length: 2. m; Tstart: 50. C |
Packed | SE-30 | 1278. | Gnauck, 1984 | N2, Chromosorb W AW DMCS, 6. K/min; Column length: 2. m; Tstart: 50. C |
Packed | SE-30 | 1281. | Gnauck, 1984 | N2, Chromosorb W AW DMCS, 8. K/min; Column length: 2. m; Tstart: 50. C |
Packed | SE-30 | 1282. | Gnauck, 1984 | N2, Chromosorb W AW DMCS, 10. K/min; Column length: 2. m; Tstart: 70. C |
Packed | SE-30 | 1285. | Gnauck, 1984 | N2, Chromosorb W AW DMCS, 4. K/min; Column length: 2. m; Tstart: 70. C |
Packed | SE-30 | 1278. | Gnauck, 1984 | N2, Chromosorb W AW DMCS, 6. K/min; Column length: 2. m; Tstart: 70. C |
Packed | SE-30 | 1282. | Gnauck, 1984 | N2, Chromosorb W AW DMCS, 8. K/min; Column length: 2. m; Tstart: 70. C |
Packed | SE-30 | 1279. | Gnauck, 1984 | N2, Chromosorb W AW DMCS, 10. K/min; Column length: 2. m; Tstart: 90. C |
Packed | SE-30 | 1283. | Gnauck, 1984 | N2, Chromosorb W AW DMCS, 4. K/min; Column length: 2. m; Tstart: 90. C |
Packed | SE-30 | 1280. | Gnauck, 1984 | N2, Chromosorb W AW DMCS, 6. K/min; Column length: 2. m; Tstart: 90. C |
Packed | SE-30 | 1280. | Gnauck, 1984 | N2, Chromosorb W AW DMCS, 8. K/min; Column length: 2. m; Tstart: 90. C |

Van Den Dool and Kratz RI, non-polar column, custom temperature program

Column type | Active phase | I | Reference | Comment |
---|---|---|---|---|
Capillary | VF-5MS | 1282.6 | Zheng and White, 2008 | 30. m/0.25 mm/0.25 μm, He; Program: not specified |

Van Den Dool and Kratz RI, polar column, temperature ramp

Column type | Active phase | I | Reference | Comment |
---|---|---|---|---|
Capillary | HP-20M | 1937. | Politeo, Jukic, et al., 2007 | 50. m/0.2 mm/0.2 μm, He, 70. C @ 4. min, 4. K/min, 180. C @ 15. min |

Normal alkane RI, polar column, temperature ramp

Column type | Active phase | I | Reference | Comment |
---|---|---|---|---|
Packed | Carbowax 20M-TPA | 1970. | Szymanowski, Kusz, et al., 1990 | Chromosorb W AW DMCS, 100. C @ 1. min, 5. K/min; Column length: 1.6 m; Tend: 220. C |
Packed | Carbowax 20M-TPA | 1970. | Szymanowski, Kusz, et al., 1990, 2 | Chromosorb W AW DMCS, 100. C @ 1. min, 5. K/min; Column length: 1.6 m; Tend: 220. C |

References

Weast and Grasselli, 1989
CRC Handbook of Data on Organic Compounds, 2nd Editon, Weast,R.C and Grasselli, J.G., ed(s)., CRC Press, Inc., Boca Raton, FL, 1989, 1. [all data]
Politeo, Jukic, et al., 2007
Politeo, O.; Jukic, M.; Milos, M.,
Chemical composition and antioxidant capacity of free volatile aglycones from basil (Ocimum basilicum L.) compared with its essential oil,
Food Chem., 2007, 101, 1, 379-385, https://doi.org/10.1016/j.foodchem.2006.01.045
. [all data]
Gnauck, 1984
Gnauck, R.,
Gaschromatographische Trennung und Identifizierung Polyfunktioneller Polyetheralkohole,
J. Chromatogr., 1984, 284, 87-96, https://doi.org/10.1016/S0021-9673(01)87804-3
. [all data]
Zheng and White, 2008
Zheng, Y.; White, E.,
Retention Data. NIST Mass Spectrometry Data Center., NIST Mass Spectrometry Data Center, 2008. [all data]
Szymanowski, Kusz, et al., 1990
Szymanowski, J.; Kusz, P.; Dziwinski, E.,
Degradation and analysis of commercial polyoxyethylene glycol mono(4-alkylphenyl) ethers,
J. Chromatogr., 1990, 511, 325-332, https://doi.org/10.1016/S0021-9673(01)93295-9
. [all data]
Szymanowski, Kusz, et al., 1990, 2
Szymanowski, J.; Kusz, P.; Dziwinski, E.; Latocha, Cz.,
Degradation and analysis of oligooxyethylene glycol mono(4-tert.-octylphenyl) ethers in the presence of acetyl chloride,
J. Chromatogr., 1990, 502, 407-415, https://doi.org/10.1016/S0021-9673(01)89606-0
. [all data]