1,4-Butanediol, diacetate
- Formula: C8H14O4
- Molecular weight: 174.1944
- IUPAC Standard InChIKey: XUKSWKGOQKREON-UHFFFAOYSA-N
- CAS Registry Number: 628-67-1
- Chemical structure:
View 3d structure (requires JavaScript / HTML 5) - Other names: Butylene glycol diacetate; Tetramethylene acetate; Tetramethylene diacetate; 1,4-Butylene glycol diacetate; 1,4-Diacetoxybutane; Butane-1,4-diol diacetate; 1,4-Butanediol, 1,4-diacetate; NSC 67924

Phase change data

Data compiled as indicated in comments:
TRC - Thermodynamics Research Center, NIST Boulder Laboratories, Chris Muzny director
BS - Robert L. Brown and Stephen E. Stein
Quantity | Value | Units | Method | Reference | Comment |
---|---|---|---|---|---|
Tboil | 503. | K | N/A | Moshkin, 1955 | Uncertainty assigned by TRC = 5. K; TRC |
Reduced pressure boiling point
Tboil (K) | Pressure (bar) | Reference | Comment |
---|---|---|---|
403. to 404. | 0.027 | Frinton Laboratories Inc., 1986 | BS |

Normal alkane RI, non-polar column, custom temperature program

Column type | Active phase | I | Reference | Comment |
---|---|---|---|---|
Capillary | Polydimethyl siloxanes | 1181. | Zenkevich and Chupalov, 1996 | Program: not specified |

Normal alkane RI, polar column, temperature ramp

Column type | Active phase | I | Reference | Comment |
---|---|---|---|---|
Capillary | DB-Wax | 1768. | Umano, Nakahara, et al., 1999 | 60. m/0.25 mm/0.25 μm, He, 40. C @ 2. min, 2. K/min; Tend: 200. C |

Normal alkane RI, polar column, custom temperature program

Column type | Active phase | I | Reference | Comment |
---|---|---|---|---|
Capillary | Carbowax 20M | 1763. | Vinogradov, 2004 | Program: not specified |

References

Moshkin, 1955
Moshkin, P.A.,
Vpr. Isolz. Pentozansoderzh. Syrya Tr. Vses. Soveshch. Riga, 1955, 1955, 225 (1958). [all data]
Frinton Laboratories Inc., 1986
Frinton Laboratories Inc.,
Catalog Number 11, Frinton Laboratories Inc., Vineland, NJ, 1986, 99. [all data]
Zenkevich and Chupalov, 1996
Zenkevich, I.G.; Chupalov, A.A.,
New Possibilities of Chromato Mass Pectrometric Identification of Organic Compounds Using Increments of Gas Chromatographic Retention Indices of Molecular Structural Fragments,
Zh. Org. Khim. (Rus.), 1996, 32, 5, 656-666. [all data]
Umano, Nakahara, et al., 1999
Umano, K.; Nakahara, K.; Shoji, A.; Shibamoto, T.,
Aroma chemicals isolated and identified from leaves of aloe arborescens Mill. Var. natalensis Berger,
J. Agric. Food Chem., 1999, 47, 9, 3702-3705, https://doi.org/10.1021/jf990116i
. [all data]
Vinogradov, 2004
Vinogradov, B.A.,
Production, composition, properties and application of essential oils, 2004, retrieved from http://viness.narod.ru. [all data]