Enanthamide
- Formula: C7H15NO
- Molecular weight: 129.2001
- IUPAC Standard InChIKey: AEDIXYWIVPYNBI-UHFFFAOYSA-N
- CAS Registry Number: 628-62-6
- Chemical structure:
View 3d structure (requires JavaScript / HTML 5) - Other names: Enanthic acid amide; Heptamide; Heptanamide; Heptanamide (enanthamide)

Phase change data

Data compiled as indicated in comments:
TRC - Thermodynamics Research Center, NIST Boulder Laboratories, Chris Muzny director
AC - William E. Acree, Jr., James S. Chickos
Quantity | Value | Units | Method | Reference | Comment |
---|---|---|---|---|---|
Tfus | 369.8 | K | N/A | Davies, Jones, et al., 1959 | Uncertainty assigned by TRC = 0.6 K; TRC |
Tfus | 369. | K | N/A | Lumsden, 1905 | Uncertainty assigned by TRC = 3. K; TRC |
Enthalpy of sublimation
ΔsubH (kJ/mol) | Temperature (K) | Method | Reference | Comment |
---|---|---|---|---|
99.6 | 345. to 365. | A | Serpinskii, Voitkevich, et al., 1954 | See also Jones, 1960 and Stephenson and Malanowski, 1987.; AC |

References

Davies, Jones, et al., 1959
Davies, M.; Jones, A.H.; Thomas, G.H.,
The lattice energies of the straight-chain primary amides,
Trans. Faraday Soc., 1959, 55, 1100. [all data]
Lumsden, 1905
Lumsden, J.S.,
The physical properties of heptoic, hexahydrobenzoic, and benzoic acids and their derivatives,
J. Chem. Soc., 1905, 87, 90-98. [all data]
Serpinskii, Voitkevich, et al., 1954
Serpinskii, V.V.; Voitkevich, S.A.; Lyuboshits, N.Y.,
Zh. Fiz. Khim., 1954, 28, 810. [all data]
Jones, 1960
Jones, A.H.,
Sublimation Pressure Data for Organic Compounds.,
J. Chem. Eng. Data, 1960, 5, 2, 196-200, https://doi.org/10.1021/je60006a019
. [all data]
Stephenson and Malanowski, 1987
Stephenson, Richard M.; Malanowski, Stanislaw,
Handbook of the Thermodynamics of Organic Compounds, 1987, https://doi.org/10.1007/978-94-009-3173-2
. [all data]