Dodecanamide, n-butyl-
- Formula: C16H33NO
- Molecular weight: 255.4393
- IUPAC Standard InChIKey: NTHVNXBUGUHNAH-UHFFFAOYSA-N
- CAS Registry Number: 6284-08-8
- Chemical structure:
- Other names: N-butyl dodecanamide

Phase change data

Data compiled as indicated in comments:
TRC - Thermodynamics Research Center, NIST Boulder Laboratories, Chris Muzny director
AC - William E. Acree, Jr., James S. Chickos
Quantity | Value | Units | Method | Reference | Comment |
---|---|---|---|---|---|
Tfus | 322. | K | N/A | Carfagna, Busico, et al., 1980 | Uncertainty assigned by TRC = 1. K; TRC |
Enthalpy of fusion
ΔfusH (kcal/mol) | Temperature (K) | Method | Reference | Comment |
---|---|---|---|---|
9.32 | 322.1 | DSC | Carfagna, Busico, et al., 1980, 2 | AC |

References

Carfagna, Busico, et al., 1980
Carfagna, C.; Busico, V.; Salerno, V.; Vacatello, M.,
Melting behaviour of a series of monoamides,
Thermochim. Acta, 1980, 37, 1, 31, https://doi.org/10.1016/0040-6031(80)85002-7
. [all data]
Carfagna, Busico, et al., 1980, 2
Carfagna, Cosimo; Busico, Vincenzo; Salerno, Vincenzo; Vacatello, Michele,
Melting behaviour of a series of monoamides,
Thermochimica Acta, 1980, 37, 1, 31-36, https://doi.org/10.1016/0040-6031(80)85002-7
. [all data]