1-Chloro-2-ethoxyethane
- Formula: C4H9ClO
- Molecular weight: 108.567
- IUPAC Standard InChIKey: GPTVQTPMFOLLOA-UHFFFAOYSA-N
- CAS Registry Number: 628-34-2
- Chemical structure:
View 3d structure (requires JavaScript / HTML 5) - Other names: 2-Chloroethyl ethyl ether; β-Chloroethyl ethyl ether; 2-Chlorodiethyl ether; Ethane, 1-chloro-2-ethoxy-; Ether, 2-chloroethyl ethyl; 2-Chloroethoxyethane; 2-Ethoxyethyl chloride; Ethyl β-chloroethyl ether

Gas phase thermochemistry data

Data compiled by: Hussein Y. Afeefy, Joel F. Liebman, and Stephen E. Stein
Quantity | Value | Units | Method | Reference | Comment |
---|---|---|---|---|---|
ΔfH°gas | -297.1 ± 2.3 | kJ/mol | Eqk | Failes and Stimson, 1967 | Reanalyzed by Cox and Pilcher, 1970, Original value = -301. kJ/mol; At 450 K |

Condensed phase thermochemistry data

Data compiled by: Hussein Y. Afeefy, Joel F. Liebman, and Stephen E. Stein
Quantity | Value | Units | Method | Reference | Comment |
---|---|---|---|---|---|
ΔfH°liquid | -335.6 ± 2.3 | kJ/mol | Eqk | Failes and Stimson, 1967 | Reanalyzed by Cox and Pilcher, 1970, Original value = -335. ± 8. kJ/mol; At 450 K |

Phase change data

Data compiled as indicated in comments:
BS - Robert L. Brown and Stephen E. Stein
TRC - Thermodynamics Research Center, NIST Boulder Laboratories, Chris Muzny director
ALS - Hussein Y. Afeefy, Joel F. Liebman, and Stephen E. Stein
Quantity | Value | Units | Method | Reference | Comment |
---|---|---|---|---|---|
Tboil | 380.7 | K | N/A | Weast and Grasselli, 1989 | BS |
Tboil | 371.7 | K | N/A | Lecat, 1947 | Uncertainty assigned by TRC = 0.6 K; TRC |
Quantity | Value | Units | Method | Reference | Comment |
ΔvapH° | 34. | kJ/mol | V | Failes and Stimson, 1967 | At 450 K; ALS |

Reaction thermochemistry data

Data compiled by: Hussein Y. Afeefy, Joel F. Liebman, and Stephen E. Stein
Individual Reactions
By formula: C4H9ClO = C4H8O + HCl
Quantity | Value | Units | Method | Reference | Comment |
---|---|---|---|---|---|
ΔrH° | 68.2 ± 2.1 | kJ/mol | Eqk | Failes and Stimson, 1967 | gas phase; Reanalyzed by Cox and Pilcher, 1970, Original value = 69.0 kJ/mol; At 450 K |

Normal alkane RI, non-polar column, temperature ramp

Column type | Active phase | I | Reference | Comment |
---|---|---|---|---|
Capillary | OV-101 | 706. | Zenkevich, Eliseenkov, et al., 2011 | 25. m/0.20 mm/0.25 μm, Nitrogen, 6. K/min; Tstart: 40. C; Tend: 220. C |

Normal alkane RI, non-polar column, custom temperature program

Column type | Active phase | I | Reference | Comment |
---|---|---|---|---|
Packed | Squalane | 704.9 | Keiko, Prokop'ev, et al., 1972 | Program: not specified |
Packed | Apiezon L | 706.2 | Keiko, Prokop'ev, et al., 1972 | Program: not specified |

References

Failes and Stimson, 1967
Failes, R.L.; Stimson, V.R.,
The thermal decomposition of 1-ethoxyethyl chloride and the reverse combination,
Aust. J. Chem., 1967, 20, 1553-1560. [all data]
Cox and Pilcher, 1970
Cox, J.D.; Pilcher, G.,
Thermochemistry of Organic and Organometallic Compounds, Academic Press, New York, 1970, 1-636. [all data]
Weast and Grasselli, 1989
CRC Handbook of Data on Organic Compounds, 2nd Editon, Weast,R.C and Grasselli, J.G., ed(s)., CRC Press, Inc., Boca Raton, FL, 1989, 1. [all data]
Lecat, 1947
Lecat, M.,
Orthobaric Azeotropes of Sulfides,
Bull. Cl. Sci., Acad. R. Belg., 1947, 33, 160-82. [all data]
Zenkevich, Eliseenkov, et al., 2011
Zenkevich, I.G.; Eliseenkov, E.V.; Kasatochkin, A.N.; Ukolov, A.I.,
Identification of the products of nonregioselective organic reactions by chromatography - mass spectrometry: chloro derivatives of dialkyl ethers,
Rus. J. Anal. Chem., 2011, 66, 14, 1445-1454, https://doi.org/10.1134/S1061934811140218
. [all data]
Keiko, Prokop'ev, et al., 1972
Keiko, V.V.; Prokop'ev, B.V.; Kuz'menko, L.P.; Kalinina, N.A.; Modonov, V.B.,
The use of an additive scheme of calculation of the indices of retention in gas-liquid chromatography communication. 3. Some regularities in the manifestation of the inductive effect,
Izv. Akad. Nauk Kaz. SSR Ser. Khim., 1972, 12, 2629-2633. [all data]