Propane, 1-ethoxy-
- Formula: C5H12O
- Molecular weight: 88.1482
- IUPAC Standard InChIKey: NVJUHMXYKCUMQA-UHFFFAOYSA-N
- CAS Registry Number: 628-32-0
- Chemical structure:
View 3d structure (requires JavaScript / HTML 5) - Other names: Ether, ethyl propyl; Ethyl n-propyl ether; Ethyl propyl ether; Propyl ethyl ether; 1-Ethoxypropane; n-C3H7OC2H5; UN 2615

Gas phase thermochemistry data

Data compiled as indicated in comments:
ALS - Hussein Y. Afeefy, Joel F. Liebman, and Stephen E. Stein
GT - Glushko Thermocenter, Russian Academy of Sciences, Moscow
Quantity | Value | Units | Method | Reference | Comment |
---|---|---|---|---|---|
ΔfH°gas | -65.05 ± 0.30 | kcal/mol | Ccb | Fenwick, Harrop, et al., 1975 | ALS |
Quantity | Value | Units | Method | Reference | Comment |
S°gas | 92.76 | cal/mol*K | N/A | Andon R.J.L., 1975 | GT |

Condensed phase thermochemistry data

Data compiled as indicated in comments:
ALS - Hussein Y. Afeefy, Joel F. Liebman, and Stephen E. Stein
DH - Eugene S. Domalski and Elizabeth D. Hearing
Quantity | Value | Units | Method | Reference | Comment |
---|---|---|---|---|---|
ΔfH°liquid | -72.56 ± 0.30 | kcal/mol | Ccb | Fenwick, Harrop, et al., 1975 | ALS |
Quantity | Value | Units | Method | Reference | Comment |
ΔcH°liquid | -807.593 | kcal/mol | Ccb | Fenwick, Harrop, et al., 1975 | Corresponding ΔfHºliquid = -72.553 kcal/mol (simple calculation by NIST; no Washburn corrections); ALS |
Quantity | Value | Units | Method | Reference | Comment |
S°liquid | 70.51 | cal/mol*K | N/A | Andon and Martin, 1975 | DH |
Constant pressure heat capacity of liquid
Cp,liquid (cal/mol*K) | Temperature (K) | Reference | Comment |
---|---|---|---|
47.13 | 298.15 | Andon and Martin, 1975 | T = 10 to 350 K.; DH |
47.20 | 298.15 | Fenwick, Harrop, et al., 1975, 2 | DH |

Phase change data

Data compiled as indicated in comments:
BS - Robert L. Brown and Stephen E. Stein
TRC - Thermodynamics Research Center, NIST Boulder Laboratories, Chris Muzny director
ALS - Hussein Y. Afeefy, Joel F. Liebman, and Stephen E. Stein
AC - William E. Acree, Jr., James S. Chickos
DH - Eugene S. Domalski and Elizabeth D. Hearing
Quantity | Value | Units | Method | Reference | Comment |
---|---|---|---|---|---|
Tboil | 336.8 | K | N/A | Weast and Grasselli, 1989 | BS |
Tboil | 336.3 | K | N/A | Majer and Svoboda, 1985 | |
Tboil | 336.4 | K | N/A | Spurr and Zeitlin, 1950 | Uncertainty assigned by TRC = 0.5 K; TRC |
Quantity | Value | Units | Method | Reference | Comment |
Tfus | 146.45 | K | N/A | Timmermans, 1952 | Uncertainty assigned by TRC = 0.4 K; TRC |
Quantity | Value | Units | Method | Reference | Comment |
Ttriple | 145.65 | K | N/A | Andon and Martin, 1975, 2 | Uncertainty assigned by TRC = 0.05 K; TRC |
Quantity | Value | Units | Method | Reference | Comment |
Tc | 500.2 | K | N/A | Majer and Svoboda, 1985 | |
Tc | 500.23 | K | N/A | Ambrose, Broderick, et al., 1974 | Uncertainty assigned by TRC = 0.2 K; TRC |
Tc | 500.6 | K | N/A | Berthoud and Brum, 1924 | Uncertainty assigned by TRC = 0.5 K; TRC |
Quantity | Value | Units | Method | Reference | Comment |
Pc | 33.26 | atm | N/A | Ambrose, Broderick, et al., 1974 | Uncertainty assigned by TRC = 0.06 atm; TRC |
Pc | 32.08 | atm | N/A | Berthoud and Brum, 1924 | Uncertainty assigned by TRC = 0.4000 atm; vapor pressure at Tc; TRC |
Quantity | Value | Units | Method | Reference | Comment |
ρc | 2.951 | mol/l | N/A | Berthoud and Brum, 1924 | Uncertainty assigned by TRC = 0.02 mol/l; TRC |
Quantity | Value | Units | Method | Reference | Comment |
ΔvapH° | 7.51 ± 0.03 | kcal/mol | AVG | N/A | Average of 6 values; Individual data points |
Enthalpy of vaporization
ΔvapH (kcal/mol) | Temperature (K) | Method | Reference | Comment |
---|---|---|---|---|
6.917 | 336.3 | N/A | Majer and Svoboda, 1985 | |
7.89 | 279. | A | Stephenson and Malanowski, 1987 | Based on data from 264. to 359. K. See also Ambrose, Ellender, et al., 1976.; AC |
6.9 | 336. | N/A | Ambrose, Ellender, et al., 1976 | Based on data from 264. to 359. K.; AC |
7.55 | 308. | N/A | Cidlinský and Polák, 1969 | Based on data from 293. to 335. K.; AC |
Enthalpy of vaporization
ΔvapH =
A exp(-βTr) (1 − Tr)β
ΔvapH =
Enthalpy of vaporization (at saturation pressure)
(kcal/mol)
Tr = reduced temperature (T / Tc)
View plot Requires a JavaScript / HTML 5 canvas capable browser.
Temperature (K) | A (kcal/mol) | β | Tc (K) | Reference | Comment |
---|---|---|---|---|---|
298. to 358. | 11.60 | 0.289 | 500.2 | Majer and Svoboda, 1985 |
Antoine Equation Parameters
log10(P) = A − (B / (T + C))
P = vapor pressure (atm)
T = temperature (K)
View plot Requires a JavaScript / HTML 5 canvas capable browser.
Temperature (K) | A | B | C | Reference |
---|---|---|---|---|
293.53 to 335.66 | 4.11567 | 1194.642 | -46.015 | Cidlinský and Polák, 1969 |
Enthalpy of fusion
ΔfusH (kcal/mol) | Temperature (K) | Reference | Comment |
---|---|---|---|
2.006 | 145.65 | Andon and Martin, 1975 | DH |
2.01 | 145.7 | Domalski and Hearing, 1996 | AC |
Entropy of fusion
ΔfusS (cal/mol*K) | Temperature (K) | Reference | Comment |
---|---|---|---|
13.78 | 145.65 | Andon and Martin, 1975 | DH |

Henry's Law data

Data compiled by: Rolf Sander
Henry's Law constant (water solution)
kH(T) = k°H exp(d(ln(kH))/d(1/T) ((1/T) - 1/(298.15 K)))
k°H = Henry's law constant for solubility in water at 298.15 K (mol/(kg*bar))
d(ln(kH))/d(1/T) = Temperature dependence constant (K)
k°H (mol/(kg*bar)) | d(ln(kH))/d(1/T) (K) | Method | Reference |
---|---|---|---|
0.87 | V | N/A | |
0.87 | V | N/A |

Normal alkane RI, non-polar column, custom temperature program

View large format table.

Column type Active phase I Reference Comment
CapillaryPolydimethyl siloxanes590.Zenkevich, Chupalov, et al., 1996Program: not specified
PackedApiezon L566.5Keiko, Prokop'ev, et al., 1972Program: not specified
PackedSqualane572.1Keiko, Prokop'ev, et al., 1972Program: not specified

References

Fenwick, Harrop, et al., 1975
Fenwick, J.O.; Harrop, D.; Head, A.J.,
Thermodynamic properties of organic oxygen compounds. 41. Enthalpies of formation of eight ethers,
J. Chem. Thermodyn., 1975, 7, 943-954. [all data]
Andon R.J.L., 1975
Andon R.J.L.,
Thermodynamic properties of organic oxygen compounds. 40. Heat capacity and entropy of six ethers,
J. Chem. Thermodyn., 1975, 7, 593-606. [all data]
Andon and Martin, 1975
Andon, R.J.L.; Martin, J.F.,
Thermodynamic properties of organic oxygen compounds. 40. Heat capacity and entropy of six ethers,
J. Chem. Thermodynam., 1975, 7, 593-606. [all data]
Fenwick, Harrop, et al., 1975, 2
Fenwick, J.O.; Harrop, D.; Head, A.J.,
Thermodynamic properties of organic oxygen compounds. 41. Enthalpies of formation of eight ethers,
J. Chem. Thermodynam., 1975, 7, 944-954. [all data]
Weast and Grasselli, 1989
CRC Handbook of Data on Organic Compounds, 2nd Editon, Weast,R.C and Grasselli, J.G., ed(s)., CRC Press, Inc., Boca Raton, FL, 1989, 1. [all data]
Majer and Svoboda, 1985
Majer, V.; Svoboda, V.,
Enthalpies of Vaporization of Organic Compounds: A Critical Review and Data Compilation, Blackwell Scientific Publications, Oxford, 1985, 300. [all data]
Spurr and Zeitlin, 1950
Spurr, R.A.; Zeitlin, H.,
The dipole moments of some aliphatic ethers,
J. Am. Chem. Soc., 1950, 72, 4832. [all data]
Timmermans, 1952
Timmermans, J.,
Freezing points of organic compounds. VVI New determinations.,
Bull. Soc. Chim. Belg., 1952, 61, 393. [all data]
Andon and Martin, 1975, 2
Andon, R.J.L.; Martin, J.F.,
Thermodynamic Properties of Organic Oxygen Compounds 40. Heat Capacity and Entropy of Six Ethers,
J. Chem. Thermodyn., 1975, 7, 593. [all data]
Ambrose, Broderick, et al., 1974
Ambrose, D.; Broderick, B.E.; Townsend, R.,
The Critical Temperatures and Pressures of Thirty Organic Compounds,
J. Appl. Chem. Biotechnol., 1974, 24, 359. [all data]
Berthoud and Brum, 1924
Berthoud, A.; Brum, R.,
Physical Properties of Some Organic Compounds.,
J. Chim. Phys. Phys.-Chim. Biol., 1924, 21, 143-60. [all data]
Stephenson and Malanowski, 1987
Stephenson, Richard M.; Malanowski, Stanislaw,
Handbook of the Thermodynamics of Organic Compounds, 1987, https://doi.org/10.1007/978-94-009-3173-2
. [all data]
Ambrose, Ellender, et al., 1976
Ambrose, D.; Ellender, J.H.; Sprake, C.H.S.; Townsend, R.,
Thermodynamic properties of organic oxygen compounds XLIII. Vapour pressures of some ethers,
The Journal of Chemical Thermodynamics, 1976, 8, 2, 165-178, https://doi.org/10.1016/0021-9614(76)90090-2
. [all data]
Cidlinský and Polák, 1969
Cidlinský, J.; Polák, J.,
Saturated vapour pressures of some ethers,
Collect. Czech. Chem. Commun., 1969, 34, 4, 1317-1321, https://doi.org/10.1135/cccc19691317
. [all data]
Domalski and Hearing, 1996
Domalski, Eugene S.; Hearing, Elizabeth D.,
Heat Capacities and Entropies of Organic Compounds in the Condensed Phase. Volume III,
J. Phys. Chem. Ref. Data, 1996, 25, 1, 1, https://doi.org/10.1063/1.555985
. [all data]