3-butyne-1,4-diol
- Formula: C4H6O2
- Molecular weight: 86.0892
- IUPAC Standard InChIKey: JSPXPZKDILSYNN-UHFFFAOYSA-N
- CAS Registry Number: 628-23-9
- Chemical structure:
View 3d structure (requires JavaScript / HTML 5) - Permanent link for this species. Use this link for bookmarking this species for future reference.

Phase change data

Data compiled by: Thermodynamics Research Center, NIST Boulder Laboratories, Chris Muzny director
Quantity | Value | Units | Method | Reference | Comment |
---|---|---|---|---|---|
Tc | 597.8 | K | N/A | Young, 1994 | Uncertainty assigned by TRC = 1. K |

References

Young, 1994
Young, C.L.,
Personal Commun. 1994 1994, 1994. [all data]