Butane, 1,4-diiodo-
- Formula: C4H8I2
- Molecular weight: 309.9153
- IUPAC Standard InChIKey: ROUYUBHVBIKMQO-UHFFFAOYSA-N
- CAS Registry Number: 628-21-7
- Chemical structure:
View 3d structure (requires JavaScript / HTML 5) - Other names: 1,4-Diiodobutane; Tetramethylene diiodide; 1,4-Diodobutane; Tetramethylene iodide

Gas phase thermochemistry data

Data compiled by: Hussein Y. Afeefy, Joel F. Liebman, and Stephen E. Stein
Quantity | Value | Units | Method | Reference | Comment |
---|---|---|---|---|---|
ΔfH°gas | 29.0 ± 2.1 | kJ/mol | Ccb | Carson, Laye, et al., 1994 |

Condensed phase thermochemistry data

Data compiled by: Hussein Y. Afeefy, Joel F. Liebman, and Stephen E. Stein
Quantity | Value | Units | Method | Reference | Comment |
---|---|---|---|---|---|
ΔfH°liquid | -30.0 ± 2.0 | kJ/mol | Ccb | Carson, Laye, et al., 1994 | |
Quantity | Value | Units | Method | Reference | Comment |
ΔcH°liquid | -2687.4 ± 1.8 | kJ/mol | Ccb | Carson, Laye, et al., 1994 |

Phase change data

Data compiled as indicated in comments:
BS - Robert L. Brown and Stephen E. Stein
TRC - Thermodynamics Research Center, NIST Boulder Laboratories, Chris Muzny director
ALS - Hussein Y. Afeefy, Joel F. Liebman, and Stephen E. Stein
AC - William E. Acree, Jr., James S. Chickos
Quantity | Value | Units | Method | Reference | Comment |
---|---|---|---|---|---|
Tfus | 279.1 | K | N/A | Timmermans, 1922 | Uncertainty assigned by TRC = 0.4 K; TRC |
Quantity | Value | Units | Method | Reference | Comment |
ΔvapH° | 59.0 ± 0.6 | kJ/mol | V | Carson, Laye, et al., 1994 | ALS |
ΔvapH° | 59. | kJ/mol | GC | Carson, Laye, et al., 1994 | AC |
Reduced pressure boiling point
Tboil (K) | Pressure (bar) | Reference | Comment |
---|---|---|---|
422.7 | 0.035 | Aldrich Chemical Company Inc., 1990 | BS |

References

Carson, Laye, et al., 1994
Carson, A.S.; Laye, P.G.; Pedley, J.B.; Welsby, A.M.; Chickos, J.S.; Hosseini, S.,
The enthalpies of formation of iodoethane, 1,2-diiodoethane, 1,3-diiodopropane, and 1,4-diiodobutane,
J. Chem. Thermodyn., 1994, 26, 1103-1109. [all data]
Timmermans, 1922
Timmermans, J.,
Investigation of the Freezing Point of Organic Substances VII,
Bull. Soc. Chim. Belg., 1922, 31, 389. [all data]
Aldrich Chemical Company Inc., 1990
Aldrich Chemical Company Inc.,
Catalog Handbook of Fine Chemicals, Aldrich Chemical Company, Inc., Milwaukee WI, 1990, 1. [all data]