Butanenitrile, 4-chloro-
- Formula: C4H6ClN
- Molecular weight: 103.550
- IUPAC Standard InChIKey: ZFCFBWSVQWGOJJ-UHFFFAOYSA-N
- CAS Registry Number: 628-20-6
- Chemical structure:
View 3d structure (requires JavaScript / HTML 5) - Other names: Butyronitrile, 4-chloro-; γ-Chlorobutyronitrile; 4-Chlorobutanenitrile; 4-Chlorobutyronitrile

Phase change data

Data compiled by: Robert L. Brown and Stephen E. Stein
Quantity | Value | Units | Method | Reference | Comment |
---|---|---|---|---|---|
Tboil | 469.2 | K | N/A | Aldrich Chemical Company Inc., 1990 |

Normal alkane RI, non-polar column, temperature ramp

Column type | Active phase | I | Reference | Comment |
---|---|---|---|---|
Capillary | OV-101 | 862. | Zenkevich, 2005 | 25. m/0.20 mm/0.10 μm, N2/He, 6. K/min; Tstart: 50. C; Tend: 250. C |

References

Aldrich Chemical Company Inc., 1990
Aldrich Chemical Company Inc.,
Catalog Handbook of Fine Chemicals, Aldrich Chemical Company, Inc., Milwaukee WI, 1990, 1. [all data]
Zenkevich, 2005
Zenkevich, I.G.,
Experimentally measured retention indices., 2005. [all data]