N,N-Dipropylformamide
- Formula: C7H15NO
- Molecular weight: 129.2001
- IUPAC Standard InChIKey: XFTIKWYXFSNCQF-UHFFFAOYSA-N
- CAS Registry Number: 6282-00-4
- Chemical structure:
View 3d structure (requires JavaScript / HTML 5) - Other names: N,N-di-n-Propylformamide; Formamide, N,N-di-n-propyl-; Formamide, N,N-dipropyl-

Phase change data

Data compiled by: Robert L. Brown and Stephen E. Stein
Reduced pressure boiling point
Tboil (K) | Pressure (bar) | Reference |
---|---|---|
373. to 374. | 0.024 | Frinton Laboratories Inc., 1986 |

References

Frinton Laboratories Inc., 1986
Frinton Laboratories Inc.,
Catalog Number 11, Frinton Laboratories Inc., Vineland, NJ, 1986, 99. [all data]