Carbonochloridic acid, 3-chloropropyl ester
- Formula: C4H6Cl2O2
- Molecular weight: 156.995
- IUPAC Standard InChIKey: MTXMEFUEBCFWCY-UHFFFAOYSA-N
- CAS Registry Number: 628-11-5
- Chemical structure:
View 3d structure (requires JavaScript / HTML 5) - Other names: Formic acid, chloro-, 3-chloropropyl ester; (3-Chloropropoxy)carbonyl chloride; 3-Chloropropyl chloroformate; 3-Chloropropyl chloridocarbonate

Van Den Dool and Kratz RI, non-polar column, custom temperature program

Column type | Active phase | I | Reference | Comment |
---|---|---|---|---|
Capillary | VF-5MS | 999. | Tretyakov, 2011 | 30. m/0.25 mm/0.25 μm, He; Program: Multi-step temperature program; T(initial)=60C; T(final)=270C |

References

Tretyakov, 2011
Tretyakov, K.V.,
Retention Data. NIST Mass Spectrometry Data Center., NIST Mass Spectrometry Data Center, 2011. [all data]