Butane, 1-isothiocyanato-3-methyl-

Kovats' RI, non-polar column, isothermal

View large format table.

Column type Active phase Temperature (C) I Reference Comment
PackedUCW-98120.1040.7Rajniaková and Floch, 1993N2, Chromosorb WAW DNCS; Column length: 1.8 m

Normal alkane RI, non-polar column, temperature ramp

View large format table.

Column type Active phase I Reference Comment
CapillaryHP-11025.Valette, Fernandez, et al., 200650. m/0.2 mm/0.5 μm, He, 2. K/min, 250. C @ 40. min; Tstart: 60. C
CapillaryCP Sil 5 CB1036.Rohloff and Bones, 200530. m/0.25 mm/0.25 μm, He, 40. C @ 1. min, 4. K/min; Tend: 220. C

Normal alkane RI, polar column, temperature ramp

View large format table.

Column type Active phase I Reference Comment
CapillaryCP-Wax 52CB1418.Rohloff and Bones, 200530. m/0.32 mm/0.25 μm, He, 40. C @ 1. min, 4. K/min; Tend: 220. C

References

Rajniaková and Floch, 1993
Rajniaková, O.; Floch, L., Study of the properties of ethyl isothiocyanatocarboxylates by means of gas chromatography and mass spectroscopy, Chem. Pap., 1993, 47, 2, 106-108. [all data]

Valette, Fernandez, et al., 2006
Valette, L.; Fernandez, X.; Poulain, S.; Lizzani-Cuvelier, L.; Loiseau, A.-M., Chemical composition of the volatile extracts from Brassica oleracea L. var. botrytis 'Romanesco' cauliflower seeds, Flavour Fragr. J., 2006, 21, 1, 107-110, https://doi.org/10.1002/ffj.1530 . [all data]

Rohloff and Bones, 2005
Rohloff, J.; Bones, A.M., Volatile profiling of Arabidopsis thaliana - Putative olfactory compounds in plant communication, Phytochemistry, 2005, 66, 16, 1941-1955, https://doi.org/10.1016/j.phytochem.2005.06.021 . [all data]