SOH
- Formula: HOS
- Molecular weight: 49.072
- CAS Registry Number: 62803-12-7

Gas phase ion energetics data

Data compiled by: John E. Bartmess
De-protonation reactions
OS- + = HOS
Quantity | Value | Units | Method | Reference | Comment |
---|---|---|---|---|---|
ΔrH° | 346.9 ± 7.2 | kcal/mol | D-EA | Polak, Fiala, et al., 1991 | gas phase; ΔHf(AH) from data on HOS- |

Reaction thermochemistry data

Data compiled by: John E. Bartmess

Individual Reactions

OS- + Hydrogen cation = HOS

By formula: OS- + H+ = HOS

Quantity Value Units Method Reference Comment
Δr346.9 ± 7.2kcal/molD-EAPolak, Fiala, et al., 1991gas phase; ΔHf(AH) from data on HOS-

References

Polak, Fiala, et al., 1991
Polak, M.L.; Fiala, B.L.; Lineberger, W.C.; Ervin, K.M.,
The Ultraviolet Photoelectron Spectrum of SO-,
J. Chem. Phys., 1991, 94, 10, 6926, https://doi.org/10.1063/1.460223
. [all data]