2-Heptylthiol
- Formula: C7H16S
- Molecular weight: 132.267
- IUPAC Standard InChIKey: DAZNOIJJVKASGS-UHFFFAOYSA-N
- CAS Registry Number: 628-00-2
- Chemical structure:
View 3d structure (requires JavaScript / HTML 5) - Species with the same structure:
- Other names: 2-heptanethiol; heptane-2-thiol

Phase change data

Data compiled as indicated in comments:
TRC - Thermodynamics Research Center, NIST Boulder Laboratories, Chris Muzny director
AC - William E. Acree, Jr., James S. Chickos
Quantity | Value | Units | Method | Reference | Comment |
---|---|---|---|---|---|
Tboil | 437. | K | N/A | Jones and Reid, 1938 | Uncertainty assigned by TRC = 3. K; TRC |
Quantity | Value | Units | Method | Reference | Comment |
Tfus | 132.2 | K | N/A | Ellis and Reid, 1932 | Uncertainty assigned by TRC = 0.3 K; TRC |
Enthalpy of vaporization
ΔvapH (kJ/mol) | Temperature (K) | Method | Reference | Comment |
---|---|---|---|---|
44.1 | 358. | N/A | Dykyj, Svoboda, et al., 1999 | Based on data from 343. to 437. K.; AC |
47.2 | 360. | N/A | Dykyj, Svoboda, et al., 1999 | Based on data from 343. to 471. K.; AC |
44.2 | 356. | A | Stephenson and Malanowski, 1987 | Based on data from 341. to 443. K. See also Kkykj and Repas, 1973.; AC |

Kovats' RI, non-polar column, custom temperature program

View large format table.

Column type Active phase I Reference Comment
CapillaryApiezon M983.Zhu, Wang, et al., 2007Program: not specified

Kovats' RI, polar column, isothermal

View large format table.

Column type Active phase Temperature (C) I Reference Comment
CapillaryPEG-20M93.1165.5Morishita, Murakita, et al., 1985Column length: 50. m; Column diameter: 0.25 mm
CapillaryPEG-20M80.1160.Morishita, Murakita, et al., 1982N2; Column length: 50. m; Column diameter: 0.25 mm

Kovats' RI, polar column, custom temperature program

View large format table.

Column type Active phase I Reference Comment
CapillaryPEG-20M1197.Zhu, Wang, et al., 2007Program: not specified

References

Jones and Reid, 1938
Jones, S.O.; Reid, E.E.,
The Addition of Sulfurl, Hydrogen Sulfide and Mercaptans to Unsaturated Hydrocarbons,
J. Am. Chem. Soc., 1938, 60, 2452. [all data]
Ellis and Reid, 1932
Ellis, L.M.; Reid, E.E.,
The Preparation and Properties of A Double Series of Aliphatic Mercaptans,
J. Am. Chem. Soc., 1932, 54, 1674. [all data]
Dykyj, Svoboda, et al., 1999
Dykyj, J.; Svoboda, J.; Wilhoit, R.C.; Frenkel, M.L.; Hall, K.R.,
Vapor Pressure of Chemicals: Part A. Vapor Pressure and Antoine Constants for Hydrocarbons and Sulfur, Selenium, Tellurium and Hydrogen Containing Organic Compounds, Springer, Berlin, 1999, 373. [all data]
Stephenson and Malanowski, 1987
Stephenson, Richard M.; Malanowski, Stanislaw,
Handbook of the Thermodynamics of Organic Compounds, 1987, https://doi.org/10.1007/978-94-009-3173-2
. [all data]
Kkykj and Repas, 1973
Kkykj, J.; Repas, M.,
Petrochemia, 1973, 13, 179. [all data]