1-Hexanol, 5-methyl-
- Formula: C7H16O
- Molecular weight: 116.2013
- IUPAC Standard InChIKey: ZVHAANQOQZVVFD-UHFFFAOYSA-N
- CAS Registry Number: 627-98-5
- Chemical structure:
View 3d structure (requires JavaScript / HTML 5) - Species with the same structure:
- Other names: 5-Methyl-1-hexanol; 5-methylhexan-1-ol

Phase change data

Data compiled by: Thermodynamics Research Center, NIST Boulder Laboratories, Chris Muzny director
Quantity | Value | Units | Method | Reference | Comment |
---|---|---|---|---|---|
Tboil | 440.65 | K | N/A | Nazarov, Kakhniashvili, et al., 1954 | Uncertainty assigned by TRC = 2. K |
Tboil | 445.15 | K | N/A | Cook, 1952 | Uncertainty assigned by TRC = 1. K |
Tboil | 441.15 | K | N/A | Sorm and Arient, 1950 | Uncertainty assigned by TRC = 2. K |

Van Den Dool and Kratz RI, polar column, custom temperature program

Column type | Active phase | I | Reference | Comment |
---|---|---|---|---|
Capillary | DB-Wax | 1466. | Radovic, Careri, et al., 2001 | 30. m/0.25 mm/0.25 μm; Program: 30C(8min) => 4C/min => 60C => 6C/min => 160C => 20C/min => 200C(1min) |

Normal alkane RI, non-polar column, custom temperature program

Column type | Active phase | I | Reference | Comment |
---|---|---|---|---|
Capillary | HP-5 | 930. | Splivallo, Bossi, et al., 2007 | He; Program: 50C => 3C/min => 200C(10min) => 10C/min => 290C(10min) |

References

Nazarov, Kakhniashvili, et al., 1954
Nazarov, I.N.; Kakhniashvili, A.I.; Ryabchenko, V.F.,
Acetylene Derivatives CLVIII. Isomerization of Dienic Dichlorides in Exchange Reactions and the Synthesis of Chlorodienic Alcohols,
Sb. Statei Obshch. Khim., 1954, 2, 913-8. [all data]
Cook, 1952
Cook, N.C.,
, Unpublished, Final Rep. Stand. Proj. on Oxygenated Compounds, Penn. State Univ., College Park, PA, 1952. [all data]
Sorm and Arient, 1950
Sorm, F.; Arient,
Collect. Czech. Chem. Commun., 1950, 15, 175. [all data]
Radovic, Careri, et al., 2001
Radovic, B.S.; Careri, M.; Mangia, A.; Musci, M.; Gerboles, M.; Anklam, E.,
Analytical, nutritional, and clinical methods section. Contribution of dynamic headspace GC-MS analysis of aroma compounds to authenticity testing of honey,
Food Chem., 2001, 72, 4, 511-520, https://doi.org/10.1016/S0308-8146(00)00263-6
. [all data]
Splivallo, Bossi, et al., 2007
Splivallo, R.; Bossi, S.; Maffei, M.; Bonfante, P.,
Discrimination of truffle fruiting body versus mycelial aromas by stir bar sorptive extraction,
Phytochemistry, 2007, 68, 20, 2584-2598, https://doi.org/10.1016/j.phytochem.2007.03.030
. [all data]