Glycylglycine ethyl ester
- Formula: C6H12N2O4
- Molecular weight: 176.1705
- IUPAC Standard InChIKey: LFAVEINQLWIXRA-UHFFFAOYSA-N
- CAS Registry Number: 627-74-7
- Chemical structure:

Reaction thermochemistry data

Data compiled by: Robert C. Dunbar
Individual Reactions
By formula: Na+ + C6H12N2O4 = (Na+ • C6H12N2O4)
Quantity | Value | Units | Method | Reference | Comment |
---|---|---|---|---|---|
ΔrH° | 181. ± 7.1 | kJ/mol | CIDC | Cerda, Hoyau, et al., 1998 |

Ion clustering data

Data compiled by: Robert C. Dunbar
Clustering reactions
By formula: Na+ + C6H12N2O4 = (Na+ • C6H12N2O4)
Quantity | Value | Units | Method | Reference | Comment |
---|---|---|---|---|---|
ΔrH° | 181. ± 7.1 | kJ/mol | CIDC | Cerda, Hoyau, et al., 1998 |

Condensed phase thermochemistry data

Data compiled by: Hussein Y. Afeefy, Joel F. Liebman, and Stephen E. Stein

Quantity Value Units Method Reference Comment
Δcsolid-3370.6kJ/molCcbLemoult, 1904

References

Cerda, Hoyau, et al., 1998
Cerda, B.A.; Hoyau, S.; Ohanessian, G.; Wesdemiotis, C.,
PAs of Peptides,
J. Am. Chem. Soc., 1998, 120, 2437. [all data]