2-Hexanol, 5-methyl-
- Formula: C7H16O
- Molecular weight: 116.2013
- IUPAC Standard InChIKey: ZDVJGWXFXGJSIU-UHFFFAOYSA-N
- CAS Registry Number: 627-59-8
- Chemical structure:
View 3d structure (requires JavaScript / HTML 5) - Other names: 5-Methyl-2-hexanol; 2-Methyl-5-hexanol; 5-Methylhexanol-(2); 5-methylhexan-2-ol

Phase change data

Data compiled as indicated in comments:
BS - Robert L. Brown and Stephen E. Stein
TRC - Thermodynamics Research Center, NIST Boulder Laboratories, Chris Muzny director
AC - William E. Acree, Jr., James S. Chickos
Quantity | Value | Units | Method | Reference | Comment |
---|---|---|---|---|---|
Tboil | 422.2 | K | N/A | Aldrich Chemical Company Inc., 1990 | BS |
Tboil | 422.15 | K | N/A | Malinovskii, Volkova, et al., 1949 | Uncertainty assigned by TRC = 3. K; TRC |
Tboil | 422.15 | K | N/A | Rohn, 1878 | Uncertainty assigned by TRC = 3. K; TRC |
Tboil | 422. | K | N/A | Rohn, 1877 | Uncertainty assigned by TRC = 5. K; TRC |
Enthalpy of vaporization
ΔvapH (kJ/mol) | Temperature (K) | Reference | Comment |
---|---|---|---|
49.4 | 388. | Wilhoit and Zwolinski, 1973 | Based on data from 348. to 428. K.; AC |

References

Aldrich Chemical Company Inc., 1990
Aldrich Chemical Company Inc.,
Catalog Handbook of Fine Chemicals, Aldrich Chemical Company, Inc., Milwaukee WI, 1990, 1. [all data]
Malinovskii, Volkova, et al., 1949
Malinovskii, M.S.; Volkova, E.E.; Morozova, N.M.,
The production of alcohols from olefin oxides: II the synthesis of 2,2- dimethylbutanol-4 and 2,2-dimethylpentanol-5 from ethylene oxide and heptanol-6, and of 2-methylhexanol-2 from propylene oxide,
Zh. Obshch. Khim., 1949, 19, 114-7. [all data]
Rohn, 1878
Rohn, W.,
Justus Liebigs Ann. Chem., 1878, 190, 305. [all data]
Rohn, 1877
Rohn, W.,
Justus Liebigs Ann. Chem., 1877, 189, 305-22. [all data]
Wilhoit and Zwolinski, 1973
Wilhoit, R.C.; Zwolinski, B.J.,
Physical and thermodynamic properties of aliphatic alcohols,
J. Phys. Chem. Ref. Data Suppl., 1973, 1, 2, 1. [all data]