1-Propene, 3-methoxy-
- Formula: C4H8O
- Molecular weight: 72.1057
- IUPAC Standard InChIKey: FASUFOTUSHAIHG-UHFFFAOYSA-N
- CAS Registry Number: 627-40-7
- Chemical structure:
View 3d structure (requires JavaScript / HTML 5) - Other names: Ether, allyl methyl; Allyl methyl ether; Methyl allyl ether; Methyl 2-propenyl ether; 1-Methoxy-2-propene; 3-Methoxypropene; 4-Oxapent-1-ene; CH2=CHCH2OCH3; 3-Methoxy-1-propene

Phase change data

Data compiled as indicated in comments:
BS - Robert L. Brown and Stephen E. Stein
TRC - Thermodynamics Research Center, NIST Boulder Laboratories, Chris Muzny director
Quantity | Value | Units | Method | Reference | Comment |
---|---|---|---|---|---|
Tboil | 319.2 | K | N/A | Weast and Grasselli, 1989 | BS |
Tboil | 319.15 | K | N/A | Katritzky, Pinzelli, et al., 1970 | Uncertainty assigned by TRC = 2. K; TRC |
Tboil | 320. | K | N/A | Shikhmamedbekova and Sultanov, 1970 | Uncertainty assigned by TRC = 3. K; TRC |

Reaction thermochemistry data

Data compiled as indicated in comments:
B - John E. Bartmess
ALS - Hussein Y. Afeefy, Joel F. Liebman, and Stephen E. Stein
Individual Reactions
C4H7O- + =
By formula: C4H7O- + H+ = C4H8O
Quantity | Value | Units | Method | Reference | Comment |
---|---|---|---|---|---|
ΔrH° | 1626. ± 17. | kJ/mol | G+TS | Dahlke and Kass, 1991 | gas phase; Between H2O, furan. Reprotonation site uncertain; B |
Quantity | Value | Units | Method | Reference | Comment |
ΔrG° | 1598. ± 17. | kJ/mol | IMRB | Dahlke and Kass, 1991 | gas phase; Between H2O, furan. Reprotonation site uncertain; B |
By formula: C4H8O = C4H8O
Quantity | Value | Units | Method | Reference | Comment |
---|---|---|---|---|---|
ΔrH° | -20.2 ± 0.2 | kJ/mol | Eqk | Taskinen, 1993 | liquid phase; solvent: DMSO; Isomerization; ALS |

Gas phase ion energetics data

Data compiled as indicated in comments:
B - John E. Bartmess
LBLHLM - Sharon G. Lias, John E. Bartmess, Joel F. Liebman, John L. Holmes, Rhoda D. Levin, and W. Gary Mallard
LLK - Sharon G. Lias, Rhoda D. Levin, and Sherif A. Kafafi
Ionization energy determinations
IE (eV) | Method | Reference | Comment |
---|---|---|---|
9.56 | EI | Holmes and Lossing, 1986 | LBLHLM |
9.84 ± 0.05 | PE | McAlduff, Caramella, et al., 1978 | Vertical value; LLK |
Appearance energy determinations
Ion | AE (eV) | Other Products | Method | Reference | Comment |
---|---|---|---|---|---|
C2H5O+ | 10.74 ± 0.05 | C2H3 | EI | Holmes and Lossing, 1984 | LBLHLM |
De-protonation reactions
C4H7O- + =
By formula: C4H7O- + H+ = C4H8O
Quantity | Value | Units | Method | Reference | Comment |
---|---|---|---|---|---|
ΔrH° | 1626. ± 17. | kJ/mol | G+TS | Dahlke and Kass, 1991 | gas phase; Between H2O, furan. Reprotonation site uncertain; B |
Quantity | Value | Units | Method | Reference | Comment |
ΔrG° | 1598. ± 17. | kJ/mol | IMRB | Dahlke and Kass, 1991 | gas phase; Between H2O, furan. Reprotonation site uncertain; B |

Normal alkane RI, non-polar column, temperature ramp

Data compiled by: NIST Mass Spectrometry Data Center, William E. Wallace, director

Column type Capillary
Active phase OV-101
Column length (m) 25.
Carrier gas N2/He
Substrate
Column diameter (mm) 0.20
Phase thickness (μm) 0.10
Tstart (C) 50.
Tend (C) 250.
Heat rate (K/min) 6.
Initial hold (min)
Final hold (min)
I 529.
ReferenceZenkevich, 2005
Comment MSDC-RI

References

Weast and Grasselli, 1989
CRC Handbook of Data on Organic Compounds, 2nd Editon, Weast,R.C and Grasselli, J.G., ed(s)., CRC Press, Inc., Boca Raton, FL, 1989, 1. [all data]
Katritzky, Pinzelli, et al., 1970
Katritzky, A.R.; Pinzelli, R.F.; Sinnot, M.V.; Topsom, R.D.,
Infrared INtensities as a Quantitative Measure of Intramoelcular Inter- actions XV. Monosubstituted Ethylenes,
J. Am. Chem. Soc., 1970, 92, 6861. [all data]
Shikhmamedbekova and Sultanov, 1970
Shikhmamedbekova, A.Z.; Sultanov, R.A.,
Addition of α-Chloromethyl Ethersto Trialkylenylsilanes,
Zh, Obshch, Khim., 1970, 40, 77-84. [all data]
Dahlke and Kass, 1991
Dahlke, G.D.; Kass, S.R.,
Substituent Effects in the Gas Phase - 1-Substituted Allyl Anions,
J. Am. Chem. Soc., 1991, 113, 15, 5566, https://doi.org/10.1021/ja00015a008
. [all data]
Taskinen, 1993
Taskinen, E.,
Relative thermodynamic stabilities of isomeric alkyl allyl and alkyl (Z)-propenyl ethers,
Tetrahedron, 1993, 49, 11389-11394. [all data]