Propanal, oxime
- Formula: C3H7NO
- Molecular weight: 73.0938
- IUPAC Standard InChIKey: IFDZZSXEPSSHNC-UHFFFAOYSA-N
- CAS Registry Number: 627-39-4
- Chemical structure:
View 3d structure (requires JavaScript / HTML 5) - Other names: Propionaldehyde oxime

Phase change data

Data compiled by: William E. Acree, Jr., James S. Chickos
Enthalpy of vaporization
ΔvapH (kJ/mol) | Temperature (K) | Method | Reference | Comment |
---|---|---|---|---|
51.2 | 326. | A | Stephenson and Malanowski, 1987 | Based on data from 313. to 339. K. |

Normal alkane RI, non-polar column, temperature ramp

Column type | Active phase | I | Reference | Comment |
---|---|---|---|---|
Capillary | OV-101 | 689. | Zenkevich, 2005 | 25. m/0.20 mm/0.10 μm, N2/He, 6. K/min; Tstart: 50. C; Tend: 250. C |

References

Stephenson and Malanowski, 1987
Stephenson, Richard M.; Malanowski, Stanislaw,
Handbook of the Thermodynamics of Organic Compounds, 1987, https://doi.org/10.1007/978-94-009-3173-2
. [all data]
Zenkevich, 2005
Zenkevich, I.G.,
Experimentally measured retention indices., 2005. [all data]