Propane, 1,3-diiodo-
- Formula: C3H6I2
- Molecular weight: 295.8887
- IUPAC Standard InChIKey: AAAXMNYUNVCMCJ-UHFFFAOYSA-N
- CAS Registry Number: 627-31-6
- Chemical structure:
View 3d structure (requires JavaScript / HTML 5) - Other names: Trimethylene diiodide; 1,3-Diiodopropane

Gas phase thermochemistry data

Data compiled by: Hussein Y. Afeefy, Joel F. Liebman, and Stephen E. Stein
Quantity | Value | Units | Method | Reference | Comment |
---|---|---|---|---|---|
ΔfH°gas | 45.2 ± 1.5 | kJ/mol | Ccb | Carson, Laye, et al., 1994 | |
ΔfH°gas | 44. ± 2. | kJ/mol | Eqk | Benson and Amano, 1962 |

Condensed phase thermochemistry data

Data compiled as indicated in comments:
ALS - Hussein Y. Afeefy, Joel F. Liebman, and Stephen E. Stein
DH - Eugene S. Domalski and Elizabeth D. Hearing
Quantity | Value | Units | Method | Reference | Comment |
---|---|---|---|---|---|
ΔfH°liquid | -8.9 ± 1.4 | kJ/mol | Ccb | Carson, Laye, et al., 1994 | ALS |
Quantity | Value | Units | Method | Reference | Comment |
ΔcH°liquid | -2029.1 ± 1.0 | kJ/mol | Ccb | Carson, Laye, et al., 1994 | ALS |
Constant pressure heat capacity of liquid
Cp,liquid (J/mol*K) | Temperature (K) | Reference | Comment |
---|---|---|---|
169.2 | 298.15 | Shehatta, 1993 | DH |

Phase change data

Data compiled as indicated in comments:
BS - Robert L. Brown and Stephen E. Stein
ALS - Hussein Y. Afeefy, Joel F. Liebman, and Stephen E. Stein
AC - William E. Acree, Jr., James S. Chickos
Quantity | Value | Units | Method | Reference | Comment |
---|---|---|---|---|---|
ΔvapH° | 54.1 ± 0.6 | kJ/mol | V | Carson, Laye, et al., 1994 | ALS |
ΔvapH° | 54.1 | kJ/mol | GC | Carson, Laye, et al., 1994 | AC |
Reduced pressure boiling point
Tboil (K) | Pressure (bar) | Reference | Comment |
---|---|---|---|
385.2 | 0.041 | Aldrich Chemical Company Inc., 1990 | BS |

Reaction thermochemistry data

Data compiled by: Hussein Y. Afeefy, Joel F. Liebman, and Stephen E. Stein
Individual Reactions
By formula: C3H6I2 = C3H6 + I2
Quantity | Value | Units | Method | Reference | Comment |
---|---|---|---|---|---|
ΔrH° | 77. ± 17. | kJ/mol | Eqk | Benson and Amano, 1962 | gas phase |

References

Carson, Laye, et al., 1994
Carson, A.S.; Laye, P.G.; Pedley, J.B.; Welsby, A.M.; Chickos, J.S.; Hosseini, S.,
The enthalpies of formation of iodoethane, 1,2-diiodoethane, 1,3-diiodopropane, and 1,4-diiodobutane,
J. Chem. Thermodyn., 1994, 26, 1103-1109. [all data]
Benson and Amano, 1962
Benson, S.W.; Amano, A.,
Thermodynamics of iodine addition to ethylene, propylene, and cyclopropane,
J. Chem. Phys., 1962, 36, 3464-3471. [all data]
Shehatta, 1993
Shehatta, I.,
Heat capacity at constant pressure of some halogen compounds,
Thermochim. Acta, 1993, 213, 1-10. [all data]
Aldrich Chemical Company Inc., 1990
Aldrich Chemical Company Inc.,
Catalog Handbook of Fine Chemicals, Aldrich Chemical Company, Inc., Milwaukee WI, 1990, 1. [all data]