2-Propyn-1-ol, acetate
- Formula: C5H6O2
- Molecular weight: 98.0999
- IUPAC Standard InChIKey: RIZZXCJMFIGMON-UHFFFAOYSA-N
- CAS Registry Number: 627-09-8
- Chemical structure:
View 3d structure (requires JavaScript / HTML 5) - Other names: Propargyl acetate; Propargyl alcohol acetate; 2-Propynyl acetate; 3-Acetoxypropyne

Phase change data

Data compiled as indicated in comments:
BS - Robert L. Brown and Stephen E. Stein
TRC - Thermodynamics Research Center, NIST Boulder Laboratories, Chris Muzny director
Quantity | Value | Units | Method | Reference | Comment |
---|---|---|---|---|---|
Tboil | 397.7 | K | N/A | Weast and Grasselli, 1989 | BS |
Tboil | 395. | K | N/A | Bruhl, 1880 | Uncertainty assigned by TRC = 4. K; TRC |
Tboil | 397. | K | N/A | Bruhl, 1880 | Uncertainty assigned by TRC = 4. K; TRC |
Reduced pressure boiling point
Tboil (K) | Pressure (bar) | Reference | Comment |
---|---|---|---|
301. | 0.01 | Farchan Laboratories, 1990 | BS |

Van Den Dool and Kratz RI, non-polar column, temperature ramp

Column type | Active phase | I | Reference | Comment |
---|---|---|---|---|
Capillary | SE-30 | 672. | Korhonen, 1984 | N2, 6. K/min; Column length: 25. m; Column diameter: 0.30 mm; Tstart: 50. C |

Van Den Dool and Kratz RI, polar column, temperature ramp

Column type | Active phase | I | Reference | Comment |
---|---|---|---|---|
Capillary | OV-351 | 1215. | Korhonen, 1984 | N2, 6. K/min; Column length: 25. m; Column diameter: 0.32 mm; Tstart: 50. C |

References

Weast and Grasselli, 1989
CRC Handbook of Data on Organic Compounds, 2nd Editon, Weast,R.C and Grasselli, J.G., ed(s)., CRC Press, Inc., Boca Raton, FL, 1989, 1. [all data]
Bruhl, 1880
Bruhl, J.W.,
The Chemical Constitution of Organic Compounds in Relation to Their Density and Their Light Propagating Ability,
Justus Liebigs Ann. Chem., 1880, 200, 139-231. [all data]
Farchan Laboratories, 1990
Farchan Laboratories,
Research Chemicals Catalog, Farchan Laboratories, Gainesville, FL, 1990, 91. [all data]
Korhonen, 1984
Korhonen, I.O.O.,
Gas-Liquid Chromatographic Analyses. XXVI. Separation of Unsaturated Alcohols and Their Acetyl and Haloacetyl Derivatives on Capillary Columns Coated with SE-30 and OV-351,
J. Chromatogr., 1984, 288, 329-346, https://doi.org/10.1016/S0021-9673(01)93710-0
. [all data]