Propane, 1-(1-methylethoxy)-
- Formula: C6H14O
- Molecular weight: 102.1748
- IUPAC Standard InChIKey: JIEJJGMNDWIGBJ-UHFFFAOYSA-N
- CAS Registry Number: 627-08-7
- Chemical structure:
View 3d structure (requires JavaScript / HTML 5) - Other names: Ether, isopropyl propyl; Isopropyl propyl ether; Propyl isopropyl ether

Phase change data

Data compiled as indicated in comments:
BS - Robert L. Brown and Stephen E. Stein
Quantity | Value | Units | Method | Reference | Comment |
---|---|---|---|---|---|
Tboil | 356.2 | K | N/A | Weast and Grasselli, 1989 | BS |
Tboil | 356.2 | K | N/A | Majer and Svoboda, 1985 | |
Quantity | Value | Units | Method | Reference | Comment |
ΔvapH° | 33.95 | kJ/mol | N/A | Majer and Svoboda, 1985 |
Enthalpy of vaporization
ΔvapH (kJ/mol) | Temperature (K) | Reference | Comment |
---|---|---|---|
30.07 | 356.2 | Majer and Svoboda, 1985 |

Kovats' RI, non-polar column, isothermal

Column type | Active phase | Temperature (C) | I | Reference | Comment |
---|---|---|---|---|---|
Packed | Apiezon L | 120. | 609. | Bogoslovsky, Anvaer, et al., 1978 | Celite 545 |
Packed | Apiezon L | 160. | 613. | Bogoslovsky, Anvaer, et al., 1978 | Celite 545 |

Normal alkane RI, non-polar column, custom temperature program

Column type | Active phase | I | Reference | Comment |
---|---|---|---|---|
Capillary | Squalane | 593. | Chen, 2008 | Program: not specified |

Normal alkane RI, polar column, temperature ramp

Column type | Active phase | I | Reference | Comment |
---|---|---|---|---|
Packed | Carbowax 20M | 708. | Tsao, 1969 | Helium, Chromosorb P HMDS, 5. K/min; Column length: 2. m; Tstart: 40. C; Tend: 200. C |

References

Weast and Grasselli, 1989
CRC Handbook of Data on Organic Compounds, 2nd Editon, Weast,R.C and Grasselli, J.G., ed(s)., CRC Press, Inc., Boca Raton, FL, 1989, 1. [all data]
Majer and Svoboda, 1985
Majer, V.; Svoboda, V.,
Enthalpies of Vaporization of Organic Compounds: A Critical Review and Data Compilation, Blackwell Scientific Publications, Oxford, 1985, 300. [all data]
Bogoslovsky, Anvaer, et al., 1978
Bogoslovsky, Yu.N.; Anvaer, B.I.; Vigdergauz, M.S.,
Chromatographic constants in gas chromatography (in Russian), Standards Publ. House, Moscow, 1978, 192. [all data]
Chen, 2008
Chen, H.-F.,
Quantitative prediction of gas chromatography retention indices with support vector machines, radial basis neutral networks and multiple linear regression,
Anal. Chim. Acta, 2008, 609, 1, 24-36, https://doi.org/10.1016/j.aca.2008.01.003
. [all data]
Tsao, 1969
Tsao, J.C.Y.,
Prelimivary reports on structural study via mercury-sensitized photolysis and gas chromatography,
J. Chin. Chem. Soc., 1969, 16, 4, 152-163. [all data]