3-Nitro-2-butanol
- Formula: C4H9NO3
- Molecular weight: 119.1192
- IUPAC Standard InChIKey: OJVOGABFNZDOOZ-UHFFFAOYSA-N
- CAS Registry Number: 6270-16-2
- Chemical structure:
View 3d structure (requires JavaScript / HTML 5) - Other names: 2-Butanol, 3-nitro-; 2-Nitrobutan-3-ol; 3-nitrobutan-2-ol

Condensed phase thermochemistry data

Data compiled by: Hussein Y. Afeefy, Joel F. Liebman, and Stephen E. Stein
Quantity | Value | Units | Method | Reference | Comment |
---|---|---|---|---|---|
ΔfH°liquid | -390.3 ± 4.8 | kJ/mol | Ccb | Currie, Bennett, et al., 1952 | see Currie, 1950 |
Quantity | Value | Units | Method | Reference | Comment |
ΔcH°liquid | -2470.1 ± 4.8 | kJ/mol | Ccb | Currie, Bennett, et al., 1952 | see Currie, 1950 |

Phase change data

Data compiled by: Robert L. Brown and Stephen E. Stein
Reduced pressure boiling point
Tboil (K) | Pressure (bar) | Reference |
---|---|---|
328.2 | 0.0007 | Weast and Grasselli, 1989 |

References

Currie, Bennett, et al., 1952
Currie, R.M.; Bennett, C.O.; Holcomb, D.E.,
Heats of combustion of some nitro alcohols,
Ind. Eng. Chem., 1952, 44, 329-331. [all data]
Currie, 1950
Currie, R.M.,
Heats of combustion of some nitroalcohols, Thesis for Purdue University, 1950, 1-84. [all data]
Weast and Grasselli, 1989
CRC Handbook of Data on Organic Compounds, 2nd Editon, Weast,R.C and Grasselli, J.G., ed(s)., CRC Press, Inc., Boca Raton, FL, 1989, 1. [all data]