Pentanamide
- Formula: C5H11NO
- Molecular weight: 101.1469
- IUPAC Standard InChIKey: IPWFJLQDVFKJDU-UHFFFAOYSA-N
- CAS Registry Number: 626-97-1
- Chemical structure:
View 3d structure (requires JavaScript / HTML 5) - Other names: Valeramide; n-Valeramide; Pentanimidic acid

Condensed phase thermochemistry data

Data compiled by: Hussein Y. Afeefy, Joel F. Liebman, and Stephen E. Stein
Quantity | Value | Units | Method | Reference | Comment |
---|---|---|---|---|---|
ΔcH°solid | -3160.1 ± 1.0 | kJ/mol | Ccb | Young, Keith, et al., 1956 | Reanalyzed by Cox and Pilcher, 1970, Original value = -3157.1 ± 1.0 kJ/mol; see Dzombak, 1956 |

Phase change data

Data compiled as indicated in comments:
TRC - Thermodynamics Research Center, NIST Boulder Laboratories, Chris Muzny director
ALS - Hussein Y. Afeefy, Joel F. Liebman, and Stephen E. Stein
AC - William E. Acree, Jr., James S. Chickos
Quantity | Value | Units | Method | Reference | Comment |
---|---|---|---|---|---|
Tfus | 379.0 | K | N/A | Davies, Jones, et al., 1959 | Uncertainty assigned by TRC = 0.6 K; TRC |
Quantity | Value | Units | Method | Reference | Comment |
ΔsubH° | 89.3 ± 0.4 | kJ/mol | V | Davies, Jones, et al., 1959 | ALS |
Enthalpy of sublimation
ΔsubH (kJ/mol) | Temperature (K) | Method | Reference | Comment |
---|---|---|---|---|
89.1 | 353. to 373. | N/A | Jones, 1960 | AC |
89.3 ± 0.4 | 333. to 374. | GS | Davies, Jones, et al., 1959 | See also Cox and Pilcher, 1970, 2.; AC |
Enthalpy of fusion
ΔfusH (kJ/mol) | Temperature (K) | Reference | Comment |
---|---|---|---|
17.9 | 377.2 | Abate, Badea, et al., 2008 | AC |

Normal alkane RI, non-polar column, custom temperature program

Column type | Active phase | I | Reference | Comment |
---|---|---|---|---|
Capillary | ZB-1 MS | 918. | Bajpai, Al-Reza, et al., 2009 | 30. m/0.25 mm/0.25 μm, Helium; Program: 50 0C 3 0C/min -> 150 0C (10 min) 10 0C/min -> 250 0C |

Normal alkane RI, polar column, custom temperature program

Column type | Active phase | I | Reference | Comment |
---|---|---|---|---|
Capillary | Stabilwax DA | 2006. | Henderson and Henderson, 1992 | 15. m/0.25 mm/0.25 μm, He; Program: not specified |

References

Young, Keith, et al., 1956
Young, J.A.; Keith, J.E.; Stehle, P.; Dzombak, W.C.; Hunt, H.,
Heats of combustion of some organic nitrogen compounds,
Ind. Eng. Chem., 1956, 48, 1375-1378. [all data]
Cox and Pilcher, 1970
Cox, J.D.; Pilcher, G.,
Thermochemistry of Organic and Organometallic Compounds, Academic Press, New York, 1970, 1-636. [all data]
Dzombak, 1956
Dzombak, W.C.,
The heats of combustion of some amides and amines, Dissertation Abstr,, 1956, 22-23. [all data]
Davies, Jones, et al., 1959
Davies, M.; Jones, A.H.; Thomas, G.H.,
The lattice energies of the straight-chain primary amides,
Trans. Faraday Soc., 1959, 55, 1100. [all data]
Jones, 1960
Jones, A.H.,
Sublimation Pressure Data for Organic Compounds.,
J. Chem. Eng. Data, 1960, 5, 2, 196-200, https://doi.org/10.1021/je60006a019
. [all data]
Cox and Pilcher, 1970, 2
Cox, J.D.; Pilcher, G.,
Thermochemistry of Organic and Organometallic Compounds, Academic Press Inc., London, 1970, 643. [all data]
Abate, Badea, et al., 2008
Abate, Lorenzo; Badea, Elena; Blanco, Ignazio; Della Gatta, Giuseppe,
Heat Capacities and Enthalpies of Solid-Solid Transitions and Fusion of a Series of Eleven Primary Alkylamides by Differential Scanning Calorimetry,
J. Chem. Eng. Data, 2008, 53, 4, 959-965, https://doi.org/10.1021/je700662a
. [all data]
Bajpai, Al-Reza, et al., 2009
Bajpai, V.K.; Al-Reza, S.M.; Choi, U.L.; Lee, J.H.; Kang, S.C.,
Chemical composition, antibacterial and antioxidant activities of leaf essential oil and extracts of Metasequioa glyptostroboides Miki ex Hu,
Food Chem. Toxicol., 2009, 47, 8, 1876-1883, https://doi.org/10.1016/j.fct.2009.04.043
. [all data]
Henderson and Henderson, 1992
Henderson, D.E.; Henderson, S.K.,
Thermal decomposition of capsaicin. 1. Interactions with oleic acid at high temperatures,
J. Agric. Food Chem., 1992, 40, 11, 2263-2268, https://doi.org/10.1021/jf00023a042
. [all data]