Pentane, 1,4-dibromo-
- Formula: C5H10Br2
- Molecular weight: 229.941
- IUPAC Standard InChIKey: CNBFRBXEGGRSPL-UHFFFAOYSA-N
- CAS Registry Number: 626-87-9
- Chemical structure:

Condensed phase thermochemistry data

Data compiled by: Hussein Y. Afeefy, Joel F. Liebman, and Stephen E. Stein
Quantity | Value | Units | Method | Reference | Comment |
---|---|---|---|---|---|
ΔfH°liquid | -173.2 | kJ/mol | Eqk | Rozhnov, Alenin, et al., 1974 |

Phase change data

Data compiled as indicated in comments:
BS - Robert L. Brown and Stephen E. Stein
AC - William E. Acree, Jr., James S. Chickos
Reduced pressure boiling point
Tboil (K) | Pressure (bar) | Reference | Comment |
---|---|---|---|
371.7 | 0.033 | Aldrich Chemical Company Inc., 1990 | BS |
Enthalpy of vaporization
ΔvapH (kJ/mol) | Temperature (K) | Method | Reference | Comment |
---|---|---|---|---|
51.8 | 392. | A | Stephenson and Malanowski, 1987 | Based on data from 377. to 524. K. See also Dykyj, 1972.; AC |

Reaction thermochemistry data

Data compiled by: Hussein Y. Afeefy, Joel F. Liebman, and Stephen E. Stein
Individual Reactions
By formula: C5H10Br2 = C5H10Br2
Quantity | Value | Units | Method | Reference | Comment |
---|---|---|---|---|---|
ΔrH° | -2.5 ± 0.08 | kJ/mol | Eqk | Rozhnov, Nesterova, et al., 1974 | liquid phase; Heat of isomerization |
By formula: C5H10Br2 = C5H10Br2
Quantity | Value | Units | Method | Reference | Comment |
---|---|---|---|---|---|
ΔrH° | -10. ± 3. | kJ/mol | Eqk | Rozhnov, Nesterova, et al., 1974 | liquid phase; Heat of isomerization |
By formula: C5H10Br2 = C5H10Br2
Quantity | Value | Units | Method | Reference | Comment |
---|---|---|---|---|---|
ΔrH° | 6.02 | kJ/mol | Eqk | Rozhnov, Alenin, et al., 1974, 2 | liquid phase |

References

Rozhnov, Alenin, et al., 1974
Rozhnov, A.M.; Alenin, V.I.; Nesterova, T.N.,
Equilibrium in the isomerisation of dibromoalkanes. IV. Isomerisation of dibromohexanes and heats of formation of certain C5-C10 dibromoalkanes,
Russ. J. Phys. Chem. (Engl. Transl.), 1974, 48, 1701-1702. [all data]
Aldrich Chemical Company Inc., 1990
Aldrich Chemical Company Inc.,
Catalog Handbook of Fine Chemicals, Aldrich Chemical Company, Inc., Milwaukee WI, 1990, 1. [all data]
Stephenson and Malanowski, 1987
Stephenson, Richard M.; Malanowski, Stanislaw,
Handbook of the Thermodynamics of Organic Compounds, 1987, https://doi.org/10.1007/978-94-009-3173-2
. [all data]
Dykyj, 1972
Dykyj, J.,
Petrochemia, 1972, 12, 1, 13. [all data]
Rozhnov, Nesterova, et al., 1974
Rozhnov, A.M.; Nesterova, T.N.; Alenin, V.I.; Uskova, L.A.,
Equilibria in the isomerisation of dibromoalkanes. I. Isomerisation of 1,2-, 1,3-, 1,4-, and 1,5-dibromopentanes,
Russ. J. Phys. Chem. (Engl. Transl.), 1974, 48, 1268, In original 2136. [all data]
Rozhnov, Alenin, et al., 1974, 2
Rozhnov, A.M.; Alenin, V.I.; Nesterova, T.N.; Nedoshivina, A.E.,
The isomerisation equilibria of dibromoalkanes. III. Isomerisation of 1,4-, 2,3-, and 2,4-dibromopentanes,
Russ. J. Phys. Chem. (Engl. Transl.), 1974, 48, 1114. [all data]