Meso-3,4-di-1-cyclohexen-1-yl-2,2,5,5-tetramethylhexane
- Formula: C22H38
- Molecular weight: 302.5371
- IUPAC Standard InChIKey: XIRWMTOAKDZMDH-UHFFFAOYSA-N
- CAS Registry Number: 62678-54-0
- Chemical structure:
View 3d structure (requires JavaScript / HTML 5) - Species with the same structure:

Gas phase thermochemistry data

Data compiled by: Hussein Y. Afeefy, Joel F. Liebman, and Stephen E. Stein
Quantity | Value | Units | Method | Reference | Comment |
---|---|---|---|---|---|
ΔfH°gas | -244. ± 5.0 | kJ/mol | Ccb | Herberg, Beckhaus, et al., 1993 |

Condensed phase thermochemistry data

Data compiled by: Hussein Y. Afeefy, Joel F. Liebman, and Stephen E. Stein
Quantity | Value | Units | Method | Reference | Comment |
---|---|---|---|---|---|
ΔfH°solid | -361.7 | kJ/mol | Ccb | Herberg, Beckhaus, et al., 1993 | |
Quantity | Value | Units | Method | Reference | Comment |
ΔcH°solid | -13726.3 ± 4.4 | kJ/mol | Ccb | Herberg, Beckhaus, et al., 1993 | Corresponding ΔfHºsolid = -361.7 kJ/mol (simple calculation by NIST; no Washburn corrections) |

Phase change data

Data compiled as indicated in comments:
ALS - Hussein Y. Afeefy, Joel F. Liebman, and Stephen E. Stein
DRB - Donald R. Burgess, Jr.
AC - William E. Acree, Jr., James S. Chickos
Quantity | Value | Units | Method | Reference | Comment |
---|---|---|---|---|---|
ΔsubH° | 117.2 ± 2.4 | kJ/mol | V | Herberg, Beckhaus, et al., 1993 | ALS |
ΔsubH° | 117.7 | kJ/mol | N/A | Herberg, Beckhaus, et al., 1993 | DRB |
Enthalpy of sublimation
ΔsubH (kJ/mol) | Temperature (K) | Method | Reference | Comment |
---|---|---|---|---|
117.2 ± 2.4 | 376. | T | Herberg, Beckhaus, et al., 1993 | Based on data from 347. to 404. K.; AC |

References

Herberg, Beckhaus, et al., 1993
Herberg, C.; Beckhaus, H.-D.; Kortvelyesi, T.; Ruchardt, C.,
Thermolabile hydrocarbons. 32. Competing core rearrangement and homolytic decomposition of mego- and DL-3,4-di-cyclohexen-1-yl,2,2,5,5-tetramethylhexane,
Chem. Ber., 1993, 126, 117-127. [all data]