6-Methyluracil
- Formula: C5H6N2O2
- Molecular weight: 126.1133
- IUPAC Standard InChIKey: SHVCSCWHWMSGTE-UHFFFAOYSA-N
- CAS Registry Number: 626-48-2
- Chemical structure:
View 3d structure (requires JavaScript / HTML 5) - Other names: 2,4(1H,3H)-Pyrimidinedione, 6-methyl-; 2(1H)-Pyrimidinone, 4-hydroxy-6-methyl-; Pseudothymine; Uracil, 6-methyl-; 2,4-Dihydroxy-6-methylpyrimidine; 2,4-Pyrimidinediol, 6-methyl-; AWD 23-15; 6-Methyl-1H-pyrimidine-2,4-dione; 4-(6)-Methyluracil; 4-Methyluracil; NSC 9456

Condensed phase thermochemistry data

Data compiled by: Hussein Y. Afeefy, Joel F. Liebman, and Stephen E. Stein
Quantity | Value | Units | Method | Reference | Comment |
---|---|---|---|---|---|
ΔcH°solid | -2356.9 ± 0.25 | kJ/mol | Ccb | Wrede, 1911 | |
ΔcH°solid | -2374. | kJ/mol | Ccb | Fischer and Wrede, 1904 | Heat of combustion corrected for pressure |
ΔcH°solid | -2372.7 | kJ/mol | Ccb | Lemoult, 1904 |

Phase change data

Data compiled by: William E. Acree, Jr., James S. Chickos
Quantity | Value | Units | Method | Reference | Comment |
---|---|---|---|---|---|
ΔsubH° | 131. | kJ/mol | N/A | Ferro, Bencivenni, et al., 1980 | Based on data from 426. to 503. K. |

Reaction thermochemistry data

Data compiled by: John E. Bartmess
Individual Reactions
C5H5N2O2- + =
By formula: C5H5N2O2- + H+ = C5H6N2O2
Quantity | Value | Units | Method | Reference | Comment |
---|---|---|---|---|---|
ΔrH° | 1473. ± 21. | kJ/mol | IMRB | Lee, 2005 | gas phase |

Gas phase ion energetics data

Data compiled by: John E. Bartmess
De-protonation reactions
C5H5N2O2- + =
By formula: C5H5N2O2- + H+ = C5H6N2O2
Quantity | Value | Units | Method | Reference | Comment |
---|---|---|---|---|---|
ΔrH° | 1473. ± 21. | kJ/mol | IMRB | Lee, 2005 | gas phase |

References

Wrede, 1911
Wrede, F.,
Uber die Bestimmung von Berbrennungswarmen mittels der kalorimetrischen Bombe unter Benutzung des Platinwiderstandsthermometers,
Z. Phys. Chem. (Leipzig), 1911, 81-94. [all data]
Fischer and Wrede, 1904
Fischer, E.; Wrede, F.,
Uber die Verbrennungswarme einiger organischer Verbindungen,
Sitzungsber. Dtsch. Akad. Wiss. Berlin Kl. Math. Phys. Tech., 1904, 687-715. [all data]
Lemoult, 1904
Lemoult, M.P.,
Remarques sur une serie recenie de determinations calorimetriques,
Compt. Rend., 1904, 663-635. [all data]
Ferro, Bencivenni, et al., 1980
Ferro, D.; Bencivenni, L.; Teghil, R.; Pelino, M.,
J. Indian Chem. Soc., 1980, 57, 629. [all data]
Lee, 2005
Lee, J.K.,
Insights into nucleic acid reactivity through gas-phase experimental and computational studies,
Int. J. Mass Spectrom., 2005, 240, 3, 261-272, https://doi.org/10.1016/j.ijms.2004.09.020
. [all data]
Marshall and Walker, 1951
Marshall, J.R.; Walker, J.,
J. Chem. Soc., 1951, 1004. [all data]