Acetic acid, nitro-, ethyl ester
- Formula: C4H7NO4
- Molecular weight: 133.1027
- IUPAC Standard InChIKey: FTKASJMIPSSXBP-UHFFFAOYSA-N
- CAS Registry Number: 626-35-7
- Chemical structure:

Condensed phase thermochemistry data

Data compiled by: Hussein Y. Afeefy, Joel F. Liebman, and Stephen E. Stein
Quantity | Value | Units | Method | Reference | Comment |
---|---|---|---|---|---|
ΔfH°liquid | -487.0 ± 1.5 | kJ/mol | Ccb | Lebedeva, Ryadnenko, et al., 1968 | See Lebedeva, Rjadnenko, et al., 1969 |
Quantity | Value | Units | Method | Reference | Comment |
ΔcH°liquid | -2087. ± 1.5 | kJ/mol | Ccb | Lebedeva, Ryadnenko, et al., 1968 | See Lebedeva, Rjadnenko, et al., 1969 |

Phase change data

Data compiled by: Robert L. Brown and Stephen E. Stein
Reduced pressure boiling point
Tboil (K) | Pressure (bar) | Reference |
---|---|---|
379.2 | 0.033 | Weast and Grasselli, 1989 |

References

Lebedeva, Ryadnenko, et al., 1968
Lebedeva, N.D.; Ryadnenko, V.L.; Kuznetsova, I.N.,
Heats of combustion and formation of nitroacetone, ethyl nitroacetate, trinitroacetonitrile, trinitroethanol, and trinitroethyl acetate,
Russ. J. Phys. Chem. (Engl. Transl.), 1968, 42, 962-964. [all data]
Lebedeva, Rjadnenko, et al., 1969
Lebedeva, N.D.; Rjadnenko, B.L.; Gutner, N.M.,
Heats of formation of some N-containing organic compounds,
Int. Conf. Calorim. Therm. (Warsaw, Poland), 1969, 1-8. [all data]
Weast and Grasselli, 1989
CRC Handbook of Data on Organic Compounds, 2nd Editon, Weast,R.C and Grasselli, J.G., ed(s)., CRC Press, Inc., Boca Raton, FL, 1989, 1. [all data]