Benzenethiol, o-isopropyl-,
- Formula: C9H12S
- Molecular weight: 152.257
- IUPAC Standard InChIKey: QEDRUXIMTJVXFL-UHFFFAOYSA-N
- CAS Registry Number: 6262-87-9
- Chemical structure:
View 3d structure (requires JavaScript / HTML 5) - Other names: 2-Isopropylbenzenethiol

Phase change data

Data compiled by: Robert L. Brown and Stephen E. Stein
Quantity | Value | Units | Method | Reference | Comment |
---|---|---|---|---|---|
Tboil | 493.2 | K | N/A | Aldrich Chemical Company Inc., 1990 |

Van Den Dool and Kratz RI, non-polar column, custom temperature program

Column type | Active phase | I | Reference | Comment |
---|---|---|---|---|
Capillary | VF-5MS | 1237.4 | Tret'yakov, 2008 | 30. m/0.25 mm/0.25 μm, He; Program: Multi-step temperature program; T(initial)=60C; T(final)=270C |

References

Aldrich Chemical Company Inc., 1990
Aldrich Chemical Company Inc.,
Catalog Handbook of Fine Chemicals, Aldrich Chemical Company, Inc., Milwaukee WI, 1990, 1. [all data]
Tret'yakov, 2008
Tret'yakov, K.V.,
Retention Data. NIST Mass Spectrometry Data Center., NIST Mass Spectrometry Data Center, 2008. [all data]