Heptanoic acid, anhydride
- Formula: C14H26O3
- Molecular weight: 242.3544
- IUPAC Standard InChIKey: DAPZDAPTZFJZTO-UHFFFAOYSA-N
- CAS Registry Number: 626-27-7
- Chemical structure:
View 3d structure (requires JavaScript / HTML 5) - Other names: Heptanoic anhydride; n-Heptanoic acid anhydride; Enanthic anhydride; Heptanoyl anhydride; Oenanthic anhydride; n-Heptanoic anhydride

Phase change data

Data compiled as indicated in comments:
BS - Robert L. Brown and Stephen E. Stein
TRC - Thermodynamics Research Center, NIST Boulder Laboratories, Chris Muzny director
Quantity | Value | Units | Method | Reference | Comment |
---|---|---|---|---|---|
Tboil | 541.2 | K | N/A | Aldrich Chemical Company Inc., 1990 | BS |
Tboil | 530. | K | N/A | Lumsden, 1905 | Uncertainty assigned by TRC = 5. K; TRC |
Quantity | Value | Units | Method | Reference | Comment |
Tfus | 260.75 | K | N/A | Deffet, 1931 | Uncertainty assigned by TRC = 0.5 K; TRC |
Tfus | 290. | K | N/A | Lumsden, 1905 | Uncertainty assigned by TRC = 3. K; TRC |
Reduced pressure boiling point
Tboil (K) | Pressure (bar) | Reference | Comment |
---|---|---|---|
437.2 | 0.017 | Weast and Grasselli, 1989 | BS |

Van Den Dool and Kratz RI, non-polar column, custom temperature program

Column type | Active phase | I | Reference | Comment |
---|---|---|---|---|
Capillary | VF-5MS | 1675.8 | Tret'yakov, 2007 | 30. m/0.25 mm/0.25 μm, He; Program: Multi-step temperature program; T(initial)=60C; T(final)=270C |

References

Aldrich Chemical Company Inc., 1990
Aldrich Chemical Company Inc.,
Catalog Handbook of Fine Chemicals, Aldrich Chemical Company, Inc., Milwaukee WI, 1990, 1. [all data]
Lumsden, 1905
Lumsden, J.S.,
The physical properties of heptoic, hexahydrobenzoic, and benzoic acids and their derivatives,
J. Chem. Soc., 1905, 87, 90-98. [all data]
Deffet, 1931
Deffet, L.,
The Freezing Points of Organic Compounds XIII. Compounds With Seven Eight, Nine or Ten Carbon Atoms,
Bull. Soc. Chim. Belg., 1931, 40, 385-402. [all data]
Weast and Grasselli, 1989
CRC Handbook of Data on Organic Compounds, 2nd Editon, Weast,R.C and Grasselli, J.G., ed(s)., CRC Press, Inc., Boca Raton, FL, 1989, 1. [all data]
Tret'yakov, 2007
Tret'yakov, K.V.,
Retention Data. NIST Mass Spectrometry Data Center., NIST Mass Spectrometry Data Center, 2007. [all data]