Isophthalaldehyde
- Formula: C8H6O2
- Molecular weight: 134.1320
- IUPAC Standard InChIKey: IZALUMVGBVKPJD-UHFFFAOYSA-N
- CAS Registry Number: 626-19-7
- Chemical structure:
View 3d structure (requires JavaScript / HTML 5) - Other names: m-Phthalaldehyde; Isophthalic dicarboxaldehyde; Isophthaldehyde; 1,3-Benzenedicarboxaldehyde; Isophtaldehydes

Phase change data

Data compiled by: Thermodynamics Research Center, NIST Boulder Laboratories, Chris Muzny director
Quantity | Value | Units | Method | Reference | Comment |
---|---|---|---|---|---|
Tfus | 362. | K | N/A | Johnston and Williams, 1947 | Uncertainty assigned by TRC = 2. K |

Gas phase ion energetics data

Data compiled by: John E. Bartmess
Electron affinity determinations
EA (eV) | Method | Reference | Comment |
---|---|---|---|
0.971 ± 0.087 | IMRE | Mishima, Huh, et al., 1993 | ΔGea(343 K)=-23.0 kcal/mol. Reanchored to EA(PhNO2), Kebarle and Chowdhury, 1987. |
1.010 ± 0.087 | IMRE | Huh, Kang, et al., 1999 | ΔG(EA) 343K; anchored to ΔG value. Including anchor ΔS, EA is ca. 0.4 kcal/mol more bound. |

Normal alkane RI, polar column, temperature ramp

Column type | Active phase | I | Reference | Comment |
---|---|---|---|---|
Capillary | DB-Wax | 2341. | Lee and Shibamoto, 2001 | 30. m/0.25 mm/0.25 μm, He, 3. K/min, 180. C @ 40. min; Tstart: 50. C |

References

Johnston and Williams, 1947
Johnston, H.W.; Williams, J.L.R.,
Preparation of m-Divinylbenzene,
J. Am. Chem. Soc., 1947, 69, 2065. [all data]
Mishima, Huh, et al., 1993
Mishima, M.; Huh, C.; Nakamura, H.; Fujio, M.; Tsuno, Y.,
Electron Affinities of Benzaldehydes. Substituent Effects on Stabilities of Aromatic Radical Anions.,
Tetrahed. Lett., 1993, 34, 26, 4223, https://doi.org/10.1016/S0040-4039(00)60533-6
. [all data]
Kebarle and Chowdhury, 1987
Kebarle, P.; Chowdhury, S.,
Electron affinities and electron transfer reactions,
Chem. Rev., 1987, 87, 513. [all data]
Huh, Kang, et al., 1999
Huh, C.; Kang, C.H.; Lee, H.W.; Nakamura, H.; Mishima, M.; Tsuno, Y.; Yamataka, H.,
Thermodynamic stabilities and resonance demand of aromatic radical anions in the gas phase,
Bull. Chem. Soc. Japan, 1999, 72, 5, 1083-1091, https://doi.org/10.1246/bcsj.72.1083
. [all data]
Lee and Shibamoto, 2001
Lee, K.-G.; Shibamoto, T.,
Antioxidant property of aroma extract isolated from clove buds [Syzygium aromaticum (L.) Merr. et Perry],
Food Chem., 2001, 74, 4, 443-448, https://doi.org/10.1016/S0308-8146(01)00161-3
. [all data]