1,1-Dimethoxy-2,2-dimethylpropane
- Formula: C7H16O2
- Molecular weight: 132.2007
- IUPAC Standard InChIKey: XUBRLDMMLUFLRU-UHFFFAOYSA-N
- CAS Registry Number: 62617-39-4
- Chemical structure:
View 3d structure (requires JavaScript / HTML 5) - Permanent link for this species. Use this link for bookmarking this species for future reference.

Reaction thermochemistry data

Data compiled by: Hussein Y. Afeefy, Joel F. Liebman, and Stephen E. Stein
Individual Reactions
By formula: C7H16O2 + H2O = C5H10O + 2CH4O
Quantity | Value | Units | Method | Reference | Comment |
---|---|---|---|---|---|
ΔrH° | 7.925 ± 0.019 | kcal/mol | Eqk | Wiberg and Squires, 1981 | liquid phase |

References

Wiberg and Squires, 1981
Wiberg, K.B.; Squires, R.R.,
Thermochemical studies of carbonyl reactions. 2. Steric effects in acetal and ketal hydrolysis,
J. Am. Chem. Soc., 1981, 103, 4473-4478. [all data]