Benzene, 1,3-bis(chloromethyl)-
- Formula: C8H8Cl2
- Molecular weight: 175.055
- IUPAC Standard InChIKey: GRJWOKACBGZOKT-UHFFFAOYSA-N
- CAS Registry Number: 626-16-4
- Chemical structure:
View 3d structure (requires JavaScript / HTML 5) - Other names: m-Xylene, α,α'-dichloro-; α,α'-Dichloro-m-xylene; m-Xylylene dichloride; 1,3-Bis(chloromethyl)benzene; m-Bis(chloromethyl)benzene; m-Dichloroxylene

Phase change data

Data compiled as indicated in comments:
BS - Robert L. Brown and Stephen E. Stein
TRC - Thermodynamics Research Center, NIST Boulder Laboratories, Chris Muzny director
AC - William E. Acree, Jr., James S. Chickos
Quantity | Value | Units | Method | Reference | Comment |
---|---|---|---|---|---|
Tboil | 525.7 | K | N/A | Weast and Grasselli, 1989 | BS |
Tboil | 527. | K | N/A | Buckingham and Donaghy, 1982 | BS |
Quantity | Value | Units | Method | Reference | Comment |
Tfus | 305. to 307. | K | N/A | Buckingham and Donaghy, 1982 | BS |
Tfus | 310. | K | N/A | Colson, 1887 | Uncertainty assigned by TRC = 1. K; TRC |
Enthalpy of fusion
ΔfusH (kJ/mol) | Temperature (K) | Reference | Comment |
---|---|---|---|
19.51 | 307.2 | Acree, 1991 | AC |

References

Weast and Grasselli, 1989
CRC Handbook of Data on Organic Compounds, 2nd Editon, Weast,R.C and Grasselli, J.G., ed(s)., CRC Press, Inc., Boca Raton, FL, 1989, 1. [all data]
Buckingham and Donaghy, 1982
Buckingham, J.; Donaghy, S.M.,
Dictionary of Organic Compounds: Fifth Edition, Chapman and Hall, New York, 1982, 1. [all data]
Colson, 1887
Colson, XX,
C. R. Hebd. Seances Acad. Sci., 1887, 104, 428. [all data]
Acree, 1991
Acree, William E.,
Thermodynamic properties of organic compounds: enthalpy of fusion and melting point temperature compilation,
Thermochimica Acta, 1991, 189, 1, 37-56, https://doi.org/10.1016/0040-6031(91)87098-H
. [all data]