1H-Pyrrole, 2,4-dimethyl-
- Formula: C6H9N
- Molecular weight: 95.1424
- IUPAC Standard InChIKey: MFFMQGGZCLEMCI-UHFFFAOYSA-N
- CAS Registry Number: 625-82-1
- Chemical structure:

Condensed phase thermochemistry data

Data compiled by: Eugene S. Domalski and Elizabeth D. Hearing
Quantity | Value | Units | Method | Reference | Comment |
---|---|---|---|---|---|
S°liquid | 53.062 | cal/mol*K | N/A | Steele, Chirico, et al., 1986 |
Constant pressure heat capacity of liquid
Cp,liquid (cal/mol*K) | Temperature (K) | Reference | Comment |
---|---|---|---|
45.935 | 298.15 | Steele, Chirico, et al., 1986 | T = 10 to 450 K. |

Phase change data

Data compiled as indicated in comments:
TRC - Thermodynamics Research Center, NIST Boulder Laboratories, Chris Muzny director
DH - Eugene S. Domalski and Elizabeth D. Hearing
AC - William E. Acree, Jr., James S. Chickos
Quantity | Value | Units | Method | Reference | Comment |
---|---|---|---|---|---|
Tboil | 438.45 | K | N/A | Lanum and Morris, 1969 | Uncertainty assigned by TRC = 0.3 K; TRC |
Quantity | Value | Units | Method | Reference | Comment |
Tfus | 268.435 | K | N/A | Steele, Chirico, et al., 1986 | DH |
Quantity | Value | Units | Method | Reference | Comment |
Ttriple | 268.44 | K | N/A | Chirico, Hossenlopp, et al., 1994 | Uncertainty assigned by TRC = 0.01 K; TRC |
Enthalpy of fusion
ΔfusH (kcal/mol) | Temperature (K) | Reference | Comment |
---|---|---|---|
2.3 | 268.5 | Chirico, Hossenlopp, et al., 1994, 2 | AC |

Van Den Dool and Kratz RI, non-polar column, temperature ramp

Data compiled by: NIST Mass Spectrometry Data Center, William E. Wallace, director

Column type CapillaryCapillary
Active phase BPX-5DB-1
Column length (m) 50.60.
Carrier gas HeHe
Substrate
Column diameter (mm) 0.320.32
Phase thickness (μm) 0.251.
Tstart (C) 60.40.
Tend (C) 250.220.
Heat rate (K/min) 4.2.
Initial hold (min) 5.5.
Final hold (min) 10.
I 842.842.
ReferenceAmes, Guy, et al., 2001Kim, 2001
Comment MSDC-RI MSDC-RI

References

Steele, Chirico, et al., 1986
Steele, W.V.; Chirico, R.D.; Collier, W.B.; Hossenlopp, I.A.; Nguyen, A.; Strube, M.M.,
Thermochemical and thermophysical properties of organic nitrogen compounds found in fossil materials,
NIPER Report, 1986, 188, 112p. [all data]
Lanum and Morris, 1969
Lanum, W.J.; Morris, J.C.,
Physical Properties of Some Sulfur and Nitrogen Compounds,
J. Chem. Eng. Data, 1969, 14, 93-8. [all data]
Chirico, Hossenlopp, et al., 1994
Chirico, R.D.; Hossenlopp, I.A.; Gammon, B.E.; Knipmeyer, S.E.; Steele, W.V.,
Heat capacities between the temperatures 10 K and 445 K for 2,4-dimethylpyrrole and barriers to methyl-group rotation in the solid state for 2,4- and 2,5-dimethylpyrrolea,b,
J. Chem. Thermodyn., 1994, 26, 11, 1219, https://doi.org/10.1006/jcht.1994.1139
. [all data]
Chirico, Hossenlopp, et al., 1994, 2
Chirico, R.D.; Hossenlopp, I.A.; Gammon, B.E.; Knipmeyer, S.E.; Steele, W.V.,
Heat capacities between the temperatures 10 K and 445 K for 2,4-dimethylpyrrole and barriers to methyl-group rotation in the solid state for 2,4- and 2,5-dimethylpyrrolea,b,
The Journal of Chemical Thermodynamics, 1994, 26, 11, 1219-1230, https://doi.org/10.1006/jcht.1994.1139
. [all data]