Dinitromethane

Gas phase thermochemistry data

Data compiled by: Hussein Y. Afeefy, Joel F. Liebman, and Stephen E. Stein

Quantity Value Units Method Reference Comment
Δfgas-58.9 ± 4.3kJ/molCcbKnobel, Miroshnichenko, et al., 1971Reanalyzed by Cox and Pilcher, 1970, Original value = -59.4 ± 0.8 kJ/mol

Phase change data

Data compiled by: Hussein Y. Afeefy, Joel F. Liebman, and Stephen E. Stein

Quantity Value Units Method Reference Comment
Δvap46.kJ/molEKnobel, Miroshnichenko, et al., 1971

Condensed phase thermochemistry data

Data compiled by: Hussein Y. Afeefy, Joel F. Liebman, and Stephen E. Stein

Quantity Value Units Method Reference Comment
Δfliquid-25.07 ± 0.20kcal/molCcbKnobel, Miroshnichenko, et al., 1971Reanalyzed by Cox and Pilcher, 1970, Original value = -25.2 ± 0.2 kcal/mol
Quantity Value Units Method Reference Comment
Δcliquid-137.3 ± 0.2kcal/molCcbKnobel, Miroshnichenko, et al., 1971

References

Knobel, Miroshnichenko, et al., 1971
Knobel, Y.K.; Miroshnichenko, E.A.; Lebedev, Y.A., Heats of combustion of nitromethane and dinitromethane: enthalpies of formation of nitromethyl radicals and energies of dissociation of bonds in nitro derivatives of methane, Bull. Acad. Sci. USSR, Div. Chem. Sci., 1971, 425-428. [all data]

Cox and Pilcher, 1970
Cox, J.D.; Pilcher, G., Thermochemistry of Organic and Organometallic Compounds, Academic Press, New York, 1970, 1-636. [all data]