Propane, 2-methyl-1-nitro-
- Formula: C4H9NO2
- Molecular weight: 103.1198
- IUPAC Standard InChIKey: XFXRMDNWSGXSNJ-UHFFFAOYSA-N
- CAS Registry Number: 625-74-1
- Chemical structure:
View 3d structure (requires JavaScript / HTML 5) - Other names: 2-Methyl-1-nitropropane; (CH3)2CHCH2NO2; 1-Nitro-2-methylpropane; 1-Nitroisobutane; 2-Methyl-3-nitropropane

Phase change data

Data compiled as indicated in comments:
TRC - Thermodynamics Research Center, NIST Boulder Laboratories, Chris Muzny director
AC - William E. Acree, Jr., James S. Chickos
Quantity | Value | Units | Method | Reference | Comment |
---|---|---|---|---|---|
Tboil | 414.87 | K | N/A | Toops, 1956 | Uncertainty assigned by TRC = 0.06 K; TRC |
Quantity | Value | Units | Method | Reference | Comment |
Tfus | 196.3 | K | N/A | Toops, 1956 | Uncertainty assigned by TRC = 0.06 K; TRC |
Enthalpy of vaporization
ΔvapH (kJ/mol) | Temperature (K) | Method | Reference | Comment |
---|---|---|---|---|
41.1 | 362. | A,EB | Stephenson and Malanowski, 1987 | Based on data from 347. to 415. K. See also Toops, 1956, 2 and Dykyj, 1971.; AC |

Kovats' RI, non-polar column, isothermal

Column type | Active phase | Temperature (C) | I | Reference | Comment |
---|---|---|---|---|---|
Packed | SF-96 | 100. | 776. | Boneva and Dimov, 1979 | N2; Column length: 2. m |
Packed | SF-96 | 110. | 776. | Boneva and Dimov, 1979 | N2; Column length: 2. m |
Packed | SF-96 | 90. | 774. | Boneva and Dimov, 1979 | N2; Column length: 2. m |

Normal alkane RI, non-polar column, custom temperature program

Column type | Active phase | I | Reference | Comment |
---|---|---|---|---|
Capillary | DB-1 | 760. | Buttery, Teranishi, et al., 1990 | Column length: 60. m; Column diameter: 0.32 mm; Program: not specified |

References

Toops, 1956
Toops, E.E.,
Physical Properties of High Purity Nitroparaffins,
J. Phys. Chem., 1956, 60, 304-6. [all data]
Stephenson and Malanowski, 1987
Stephenson, Richard M.; Malanowski, Stanislaw,
Handbook of the Thermodynamics of Organic Compounds, 1987, https://doi.org/10.1007/978-94-009-3173-2
. [all data]
Toops, 1956, 2
Toops, Emory E.,
Physical Properties of Eight High-Purity Nitroparaffins,
J. Phys. Chem., 1956, 60, 3, 304-306, https://doi.org/10.1021/j150537a012
. [all data]
Dykyj, 1971
Dykyj, J.,
Petrochemia, 1971, 11, 2, 27. [all data]
Boneva and Dimov, 1979
Boneva, S.; Dimov, N.,
Chromatographic retention indices of C1-C4 nitroparaffins,
Zh. Anal. Khim., 1979, 34, 6, 902-905. [all data]
Buttery, Teranishi, et al., 1990
Buttery, R.G.; Teranishi, R.; Flath, R.A.; Ling, L.C.,
Identification of additional tomato paste volatiles,
J. Agric. Food Chem., 1990, 38, 3, 792-795, https://doi.org/10.1021/jf00093a042
. [all data]