Butane, 1,1-dichloro-3-methyl-
- Formula: C5H10Cl2
- Molecular weight: 141.039
- IUPAC Standard InChIKey: VXEMJASOVHTHLL-UHFFFAOYSA-N
- CAS Registry Number: 625-66-1
- Chemical structure:
View 3d structure (requires JavaScript / HTML 5) - Other names: 1,1-Dichloro-3-methylbutane

Phase change data

Data compiled by: Thermodynamics Research Center, NIST Boulder Laboratories, Chris Muzny director
Quantity | Value | Units | Method | Reference | Comment |
---|---|---|---|---|---|
Tboil | 402.75 | K | N/A | Pomerantz, Fookson, et al., 1954 | Uncertainty assigned by TRC = 0.5 K |
Tboil | 400.65 | K | N/A | Schmerling, 1949 | Uncertainty assigned by TRC = 3. K |
Tboil | 401. | K | N/A | Schmerling, 1946 | Uncertainty assigned by TRC = 3. K |
Tboil | 403.85 | K | N/A | Kohlraush and Koppl, 1935 | Uncertainty assigned by TRC = 2. K |

Reaction thermochemistry data

Data compiled by: Hussein Y. Afeefy, Joel F. Liebman, and Stephen E. Stein
Individual Reactions
By formula: C5H10Cl2 = C5H9Cl + HCl
Quantity | Value | Units | Method | Reference | Comment |
---|---|---|---|---|---|
ΔrH° | 63.32 ± 0.42 | kJ/mol | Eqk | Meged, Levanova, et al., 1978 | gas phase; Gas phase |
By formula: C5H10Cl2 = C5H9Cl
Quantity | Value | Units | Method | Reference | Comment |
---|---|---|---|---|---|
ΔrH° | 66.11 ± 0.42 | kJ/mol | Eqk | Meged, Levanova, et al., 1978 | gas phase; Gas phase |

References

Pomerantz, Fookson, et al., 1954
Pomerantz, P.; Fookson, A.; Mears, T.W.; Rothberg, S.; Howard, F.L.,
Synthesis and Physical Properties of Several Acetylenic Hydrocarbons,
J. Res. Natl. Bur. Stand. (U. S.), 1954, 52, 51. [all data]
Schmerling, 1949
Schmerling, L.,
, 1949. [all data]
Schmerling, 1946
Schmerling, L.,
Condensation of Saturated Halides with Unsaturated Compounds II. The Condensation of ALkyl Halides with Monohaloolefins,
J. Am. Chem. Soc., 1946, 68, 1650-4. [all data]
Kohlraush and Koppl, 1935
Kohlraush, K.W.F.; Koppl, F.,
The Raman effect. XXXVIII. Raman spectra of organic substances. S. Isomeric paraffin derivatives.,
Monatsh. Chem., 1935, 65, 185. [all data]
Meged, Levanova, et al., 1978
Meged, V.M.; Levanova, S.V.; Shevtsova, L.A.; Rozhnev, A.M.,
Dehydrochlorination of 1,1-dichloro-3-methylbutane and geometric isomerization of chloromethylbutenes,
Russ. J. Phys. Chem. (Engl. Transl.), 1978, 52, 285. [all data]