Benzoic acid, 2-[[(4'-amino[1,1'-biphenyl]-4-yl)amino]carbonyl]-
- Formula: C20H16N2O3
- Molecular weight: 332.3526
- IUPAC Standard InChIKey: DJQADPLIXDLPMV-UHFFFAOYSA-N
- CAS Registry Number: 62558-65-0
- Chemical structure:
View 3d structure (requires JavaScript / HTML 5) - Permanent link for this species. Use this link for bookmarking this species for future reference.

Reaction thermochemistry data

Data compiled by: Hussein Y. Afeefy, Joel F. Liebman, and Stephen E. Stein
Individual Reactions
By formula: C8H4O3 + C12H12N2 = C20H16N2O3
Quantity | Value | Units | Method | Reference | Comment |
---|---|---|---|---|---|
ΔrH° | -67.4 ± 0.4 | kJ/mol | Eqk | Karyakin, Rabinovich, et al., 1978 | liquid phase; solvent: DMF |

References

Karyakin, Rabinovich, et al., 1978
Karyakin, N.V.; Rabinovich, I.B.; Pal'tseva, N.G.,
Thermodynamics of the reactions of aromatic diamines with dianhydrides of tetracarboxylic acids,
Polym. Sci. USSR, 1978, 20, 2274-2279. [all data]