3-Penten-2-one
- Formula: C5H8O
- Molecular weight: 84.1164
- IUPAC Standard InChIKey: LABTWGUMFABVFG-UHFFFAOYSA-N
- CAS Registry Number: 625-33-2
- Chemical structure:
- Other names: Ethylidene acetone; Methyl propenyl ketone; Methyl 1-propenyl ketone; 2-Oxo-3-pentene; (E)-CH3CH=CHC(=O)CH3; 3-Pentene-2-one; Pent-3-en-2-one

Gas phase thermochemistry data

Data compiled by: Hussein Y. Afeefy, Joel F. Liebman, and Stephen E. Stein
Quantity | Value | Units | Method | Reference | Comment |
---|---|---|---|---|---|
ΔfH°gas | -32.6 | kcal/mol | Cm | Trifel, Smirnov, et al., 1992 |

Condensed phase thermochemistry data

Data compiled by: Hussein Y. Afeefy, Joel F. Liebman, and Stephen E. Stein
Quantity | Value | Units | Method | Reference | Comment |
---|---|---|---|---|---|
ΔcH°liquid | -726.9 | kcal/mol | Ccb | Clopatt, 1932 | Corresponding ΔfHºliquid = -16.6 kcal/mol (simple calculation by NIST; no Washburn corrections) |

Phase change data

Data compiled by: Robert L. Brown and Stephen E. Stein
Quantity | Value | Units | Method | Reference | Comment |
---|---|---|---|---|---|
Tboil | 395.7 | K | N/A | Aldrich Chemical Company Inc., 1990 |

Normal alkane RI, polar column, temperature ramp

Data compiled by: NIST Mass Spectrometry Data Center, William E. Wallace, director

Column type CapillaryCapillaryCapillaryCapillaryCapillary
Active phase HP-InnowaxDB-WaxHP-InnowaxFFAPRTX-Wax
Column length (m) 60.60.50.30.60.
Carrier gas HeliumHeliumHeliumN2He
Substrate
Column diameter (mm) 0.250.250.200.320.25
Phase thickness (μm) 0.250.500.200.50.5
Tstart (C) 60.40.45.35.40.
Tend (C) 220.210.190.320.180.
Heat rate (K/min) 3.2.4.4.5.
Initial hold (min) 1.5.2.5.5.
Final hold (min) 5.70.50.45.20.
I 1137.1143.1133.1141.1142.
ReferenceFeng, Zhuang, et al., 2011Moon and Shibamoto, 2010Soria, Sanz, et al., 2008Nebesny, Budryn, et al., 2007Galindo-Cuspinera, Lubran, et al., 2002
Comment MSDC-RI MSDC-RI MSDC-RI MSDC-RI MSDC-RI
Column type CapillaryCapillaryCapillaryCapillaryCapillary
Active phase HP-WaxHP-WaxHP-WaxDB-WaxDB-Wax
Column length (m) 60.60.60.60.60.
Carrier gas HeHeHeNitrogenHe
Substrate
Column diameter (mm) 0.250.250.250.250.25
Phase thickness (μm) 0.50.50.5 1.
Tstart (C) 40.40.40.40.50.
Tend (C) 190.190.190.200.200.
Heat rate (K/min) 3.3.3.2.3.
Initial hold (min) 6.6.6.10.
Final hold (min)     40.
I 1138.1138.1138.1139.1120.
ReferenceSanz, Maeztu, et al., 2002Maeztu, Sanz, et al., 2001Sanz, Ansorena, et al., 2001Tamura, Boonbumrung, et al., 2000Horiuchi, Umano, et al., 1998
Comment MSDC-RI MSDC-RI MSDC-RI MSDC-RI MSDC-RI
Column type CapillaryCapillary
Active phase DB-WaxDB-Wax
Column length (m) 60.60.
Carrier gas
Substrate
Column diameter (mm) 0.320.32
Phase thickness (μm)
Tstart (C) 50.50.
Tend (C) 230.230.
Heat rate (K/min) 4.4.
Initial hold (min)
Final hold (min) 10.10.
I 1120.1120.
ReferenceBinder, Benson, et al., 1990Binder, Turner, et al., 1990
Comment MSDC-RI MSDC-RI

Normal alkane RI, polar column, custom temperature program

Data compiled by: NIST Mass Spectrometry Data Center, William E. Wallace, director

Column type CapillaryCapillaryCapillaryCapillaryCapillary
Active phase DB-WaxHP-InnowaxSupelcowax 10HP-InnowaxHP-Innowax
Column length (m) 30.60.50.60.60.
Carrier gas HeliumHeliumHeliumHeliumHelium
Substrate
Column diameter (mm) 0.250.250.250.320.32
Phase thickness (μm) 0.250.250.250.250.25
Program not specifiednot specified45 0C (15 min) 3 0C/min -> 75 0C 5 0C/min -> 180 0C (10 min)40 0C (5 min) 4 0C/min -> 60 0C (5 min) 8 0C/min -> 250 0C (3 min)not specified
I 1132.1139.1147.1125.1121.
ReferenceWelke, Manfroi, et al., 2012Feng, Zhuang, et al., 2011Soria, Martinez-Castro, et al., 2008Viegas and Bassoli, 2007Viegas and Bassoli, 2007
Comment MSDC-RI MSDC-RI MSDC-RI MSDC-RI MSDC-RI
Column type Capillary
Active phase CP-Wax 52CB
Column length (m) 50.
Carrier gas
Substrate
Column diameter (mm) 0.32
Phase thickness (μm) 1.5
Program 40C => 2C/min => 150C => 10C/min => 250C
I 1113.
ReferenceLuning, de Rijk, et al., 1994
Comment MSDC-RI

Kovats' RI, non-polar column, temperature ramp

Data compiled by: NIST Mass Spectrometry Data Center, William E. Wallace, director

Column type CapillaryCapillary
Active phase DB-1DB-1
Column length (m) 60.60.
Carrier gas
Substrate
Column diameter (mm) 0.250.25
Phase thickness (μm) 0.250.25
Tstart (C) 30.30.
Tend (C) 220.220.
Heat rate (K/min) 2.2.
Initial hold (min) 4.4.
Final hold (min)
I 711.715.
ReferenceTakeoka, Perrino, et al., 1996Takeoka, Perrino, et al., 1996
Comment MSDC-RI MSDC-RI

Van Den Dool and Kratz RI, non-polar column, temperature ramp

Data compiled by: NIST Mass Spectrometry Data Center, William E. Wallace, director

Column type CapillaryCapillaryCapillaryCapillaryCapillary
Active phase DB-5SPB-5CP Sil 5 CBCP Sil 5 CBDB-1
Column length (m) 60.30.60.50.60.
Carrier gas  HeHeHeHe
Substrate
Column diameter (mm) 0.320.250.320.320.32
Phase thickness (μm) 1.0.250.250.41.
Tstart (C) 40.60.60.60.40.
Tend (C) 260.250.280.280.220.
Heat rate (K/min) 4.4.3.3.2.
Initial hold (min) 2.2.10.10.5.
Final hold (min) 10.20.60.60.
I 739.729.697.698.711.
ReferenceMethven L., Tsoukka M., et al., 2007Píno, Marbot, et al., 2004Pino, Almora, et al., 2003Pino, Marbot, et al., 2002Kim, 2001
Comment MSDC-RI MSDC-RI MSDC-RI MSDC-RI MSDC-RI
Column type CapillaryCapillaryCapillaryCapillary
Active phase SPB-1BP-5DB-5DB-1
Column length (m) 30.50.30.60.
Carrier gas He  He
Substrate
Column diameter (mm) 0.320.320.320.25
Phase thickness (μm) 4. 1.0.25
Tstart (C) 45.60.60.40.
Tend (C) 240.250.250.220.
Heat rate (K/min) 5.4.4.2.
Initial hold (min) 13. 5.
Final hold (min) 5. 20.10.
I 716.755.728.719.
ReferenceLarráyoz, Addis, et al., 2001Whitfield and Mottram, 2001Madruga and Mottram, 1998Zhang and Ho, 1991
Comment MSDC-RI MSDC-RI MSDC-RI MSDC-RI

References

Trifel, Smirnov, et al., 1992
Trifel, B.Yu.; Smirnov, V.V.; Gloriozov, I.P.; Kurbanov, N.I.; Mamedov, F.V.,
Mechanism of reaction between trichloroacetic acid and unsaturated ketones,
Vestn. Mosk. Univ. Ser. 2: Khim., 1992, 33, 547-550. [all data]
Clopatt, 1932
Clopatt, J.A.,
Eine neue Methode zur Bestimmung der Verbrennungswarme fluchtiger Stoffe,
Soc. Scient. Fenn. Commentat. Phys. Math., 1932, 6, 1-15. [all data]
Aldrich Chemical Company Inc., 1990
Aldrich Chemical Company Inc.,
Catalog Handbook of Fine Chemicals, Aldrich Chemical Company, Inc., Milwaukee WI, 1990, 1. [all data]