Sulphuric acid dibutyl ester
- Formula: C8H18O4S
- Molecular weight: 210.291
- IUPAC Standard InChIKey: LMEDOLJKVASKTP-UHFFFAOYSA-N
- CAS Registry Number: 625-22-9
- Chemical structure:
View 3d structure (requires JavaScript / HTML 5) - Other names: Dibutyl sulphate; Sulfuric acid, dibutyl ester; Di-n-butylsulfat; Dibutylsulfate; Di-n-butyl sulphate

Gas phase thermochemistry data

Data compiled by: Hussein Y. Afeefy, Joel F. Liebman, and Stephen E. Stein
Quantity | Value | Units | Method | Reference | Comment |
---|---|---|---|---|---|
ΔfH°gas | -829. ± 3. | kJ/mol | Ccb | Mackle and Steele, 1969 |

Condensed phase thermochemistry data

Data compiled by: Hussein Y. Afeefy, Joel F. Liebman, and Stephen E. Stein
Quantity | Value | Units | Method | Reference | Comment |
---|---|---|---|---|---|
ΔfH°liquid | -904.4 ± 2.6 | kJ/mol | Ccb | Mackle and Steele, 1969 | |
Quantity | Value | Units | Method | Reference | Comment |
ΔcH°liquid | -5418.2 ± 7.1 | kJ/mol | Ccb | Mackle and Steele, 1969 |

Phase change data

Data compiled as indicated in comments:
TRC - Thermodynamics Research Center, NIST Boulder Laboratories, Chris Muzny director
ALS - Hussein Y. Afeefy, Joel F. Liebman, and Stephen E. Stein
Quantity | Value | Units | Method | Reference | Comment |
---|---|---|---|---|---|
Tfus | 193.5 | K | N/A | Timmermans, 1922 | Uncertainty assigned by TRC = 0.5 K; TRC |
Quantity | Value | Units | Method | Reference | Comment |
ΔvapH° | 76. ± 2. | kJ/mol | E | Mackle and Steele, 1969 | ALS |

References

Mackle and Steele, 1969
Mackle, H.; Steele, W.V.,
Studies in the thermochemistry of organic sulphites and sulphates. Part 1.-Heats of combustion and formation of some dialkyl sulphites and sulphates,
Trans. Faraday Soc., 1969, 65, 2053-2059. [all data]
Timmermans, 1922
Timmermans, J.,
Investigation of the Freezing Point of Organic Substances VII,
Bull. Soc. Chim. Belg., 1922, 31, 389. [all data]