2-Butanol, 2-methyl-, acetate

Gas phase thermochemistry data

Data compiled by: Hussein Y. Afeefy, Joel F. Liebman, and Stephen E. Stein

Quantity Value Units Method Reference Comment
Δfgas-539.0 ± 1.5kJ/molCcbVerevkin, Beckhaus, et al., 1996

Condensed phase thermochemistry data

Data compiled by: Hussein Y. Afeefy, Joel F. Liebman, and Stephen E. Stein

Quantity Value Units Method Reference Comment
Δfliquid-581.8 ± 1.5kJ/molCcbVerevkin, Beckhaus, et al., 1996
Quantity Value Units Method Reference Comment
Δcliquid-4173.6 ± 1.5kJ/molCcbVerevkin, Beckhaus, et al., 1996Corresponding Δfliquid = -581.8 kJ/mol (simple calculation by NIST; no Washburn corrections)

References

Verevkin, Beckhaus, et al., 1996
Verevkin, S.P.; Beckhaus, H.-D.; Belen'kaja, R.S.; Rakus, K.; Ruchardt, C., Geminal substituent effects Part 9. Standard enthalpies of formation and strain free increments of branched esters and ethers, Thermochim. Acta, 1996, 279, 47-64. [all data]