Methanesulfonic acid, ethyl ester
- Formula: C3H8O3S
- Molecular weight: 124.159
- IUPAC Standard InChIKey: PLUBXMRUUVWRLT-UHFFFAOYSA-N
- CAS Registry Number: 62-50-0
- Chemical structure:
View 3d structure (requires JavaScript / HTML 5) - Other names: Ethyl mesylate; Ethyl methanesulfonate; EMS; NSC 26805; CB 1528; Ethyl ester of methanesulfonic acid; Ethyl ester of methylsulfonic acid; Half-Myleran; Methylsulfonic acid, ethyl ester; ENT 26396; Ethylester kyseliny methansulfonove; Ethyl ester of methanesulphonic acid; Ethyl ester of methylsulphonic acid; Ethyl methanesulphonate; Ethyl methansulfonate; Ethyl methansulphonate; Methanesulphonic acid ethyl ester; Rcra waste number U119

Lee's RI, non-polar column, temperature ramp

Column type | Active phase | I | Reference | Comment |
---|---|---|---|---|
Capillary | DB-5MS | 146.35 | Chen, Keeran, et al., 2002 | 30. m/0.25 mm/0.5 μm, 40. C @ 1. min, 10. K/min; Tend: 310. C |
Capillary | DB-5MS | 150.77 | Chen, Keeran, et al., 2002 | 30. m/0.25 mm/0.5 μm, 40. C @ 1. min, 4. K/min; Tend: 310. C |

References

Chen, Keeran, et al., 2002
Chen, P.H.; Keeran, W.S.; Van Ausdale, W.A.; Schindler, D.R.; Roberts, D.W.,
Application of Lee retention indices to the confirmation of tentatively identified compounds from GC/MS analysis of environmental samples, Technical paper, Analytical Services Division, Environmental ScienceEngineering, Inc, PO Box 1703, Gainesville, FL 32602, 2002, 11. [all data]