Ethane, (methylthio)-
- Formula: C3H8S
- Molecular weight: 76.161
- IUPAC Standard InChIKey: WXEHBUMAEPOYKP-UHFFFAOYSA-N
- CAS Registry Number: 624-89-5
- Chemical structure:
View 3d structure (requires JavaScript / HTML 5) - Other names: Sulfide, ethyl methyl; (Methylthio)ethane; Ethyl methyl sulfide; Methyl ethyl sulfide; 2-Thiabutane; Ethyl methyl sulphide; C2H5SCH3; 1-(Methylsulfanyl)ethane; Methyl ethyl sulphide

Gas phase thermochemistry data

Data compiled by: Hussein Y. Afeefy, Joel F. Liebman, and Stephen E. Stein
Quantity | Value | Units | Method | Reference | Comment |
---|---|---|---|---|---|
ΔfH°gas | -60.3 ± 1.1 | kJ/mol | Ccr | Hubbard and Waddington, 1954 | Heat of combustion calculated author's U=-675.17 |

Condensed phase thermochemistry data

Data compiled by: Hussein Y. Afeefy, Joel F. Liebman, and Stephen E. Stein
Quantity | Value | Units | Method | Reference | Comment |
---|---|---|---|---|---|
ΔfH°liquid | -92.3 ± 1.1 | kJ/mol | Ccr | Hubbard and Waddington, 1954 | Heat of combustion calculated author's U=-675.17 |
Quantity | Value | Units | Method | Reference | Comment |
ΔcH°liquid | -2833.6 ± 1.1 | kJ/mol | Ccr | Hubbard and Waddington, 1954 | Heat of combustion calculated author's U=-675.17 |

Phase change data

Data compiled as indicated in comments:
BS - Robert L. Brown and Stephen E. Stein
TRC - Thermodynamics Research Center, NIST Boulder Laboratories, Chris Muzny director
AC - William E. Acree, Jr., James S. Chickos
DRB - Donald R. Burgess, Jr.
ALS - Hussein Y. Afeefy, Joel F. Liebman, and Stephen E. Stein
Quantity | Value | Units | Method | Reference | Comment |
---|---|---|---|---|---|
Tboil | 339.8 | K | N/A | Weast and Grasselli, 1989 | BS |
Tboil | 339.8 | K | N/A | Majer and Svoboda, 1985 | |
Tboil | 340. | K | N/A | Pochinok and Limarenko, 1955 | Uncertainty assigned by TRC = 5. K; TRC |
Tboil | 339.8 | K | N/A | Mcallan, Cullum, et al., 1951 | Uncertainty assigned by TRC = 0.3 K; TRC |
Tboil | 335.2 | K | N/A | Trotter and Thompson, 1946 | Uncertainty assigned by TRC = 1.5 K; TRC |
Quantity | Value | Units | Method | Reference | Comment |
Tfus | 167.24 | K | N/A | Mcallan, Cullum, et al., 1951 | Uncertainty assigned by TRC = 0.1 K; TRC |
Quantity | Value | Units | Method | Reference | Comment |
Ttriple | 167.23 | K | N/A | Scott, Finke, et al., 1951 | Uncertainty assigned by TRC = 0.02 K; TRC |
Quantity | Value | Units | Method | Reference | Comment |
Tc | 553. | K | N/A | Majer and Svoboda, 1985 | |
Quantity | Value | Units | Method | Reference | Comment |
ΔvapH° | 31.99 | kJ/mol | N/A | Majer and Svoboda, 1985 | |
ΔvapH° | 31.5 | kJ/mol | N/A | Shimizu, Saito, et al., 1981 | AC |
ΔvapH° | 31.8 | kJ/mol | N/A | Reid, 1972 | See also Osborn and Douslin, 1966 and Hubbard and Waddington, 2010.; AC |
ΔvapH° | 32.0 | kJ/mol | N/A | Hubbard and Waddington, 1954 | DRB |
Enthalpy of vaporization
ΔvapH (kJ/mol) | Temperature (K) | Method | Reference | Comment |
---|---|---|---|---|
29.53 | 339.8 | N/A | Majer and Svoboda, 1985 | |
33.7 | 268. | N/A | Dykyj, Svoboda, et al., 1999 | Based on data from 253. to 363. K.; AC |
31.8 | 311. | A,EB | Stephenson and Malanowski, 1987 | Based on data from 296. to 373. K. See also Scott, Finke, et al., 1951, 2.; AC |
32.3 | 287. | N/A | Mackle, Mayrick, et al., 1960 | AC |
32.0 ± 0.08 | 301. | V | Hubbard and Waddington, 1954 | Heat of combustion calculated author's U=-675.17; ALS |
31.64 | 301.66 | V | Scott, Finke, et al., 1951, 2 | ALS |
30.3 | 338. | N/A | Thompson and Linnett, 1935 | AC |
Enthalpy of vaporization
ΔvapH =
A exp(-βTr) (1 − Tr)β
ΔvapH =
Enthalpy of vaporization (at saturation pressure)
(kJ/mol)
Tr = reduced temperature (T / Tc)
View plot Requires a JavaScript / HTML 5 canvas capable browser.
Temperature (K) | A (kJ/mol) | β | Tc (K) | Reference | Comment |
---|---|---|---|---|---|
302. to 340. | 47.11 | 0.298 | 553. | Majer and Svoboda, 1985 |
Antoine Equation Parameters
log10(P) = A − (B / (T + C))
P = vapor pressure (bar)
T = temperature (K)
View plot Requires a JavaScript / HTML 5 canvas capable browser.
Temperature (K) | A | B | C | Reference |
---|---|---|---|---|
296.58 to 373.97 | 4.06339 | 1182.562 | -48.366 | Osborn and Douslin, 1966 |
Enthalpy of fusion
ΔfusH (kJ/mol) | Temperature (K) | Reference | Comment |
---|---|---|---|
9.76 | 167.2 | Domalski and Hearing, 1996 | AC |

Reaction thermochemistry data

Data compiled by: Michael M. Meot-Ner (Mautner) and Sharon G. Lias
Individual Reactions
By formula: C3H9S+ + C3H8S = (C3H9S+ • C3H8S)
Quantity | Value | Units | Method | Reference | Comment |
---|---|---|---|---|---|
ΔrH° | 111. | kJ/mol | PHPMS | Meot-Ner (Mautner) and Sieck, 1985 | gas phase; ΔrH?, incosistent with other sulfur compound dimers |
Quantity | Value | Units | Method | Reference | Comment |
ΔrS° | 116. | J/mol*K | PHPMS | Meot-Ner (Mautner) and Sieck, 1985 | gas phase; ΔrH?, incosistent with other sulfur compound dimers |

Gas phase ion energetics data

Data evaluated as indicated in comments:
HL - Edward P. Hunter and Sharon G. Lias
L - Sharon G. Lias
Data compiled as indicated in comments:
LL - Sharon G. Lias and Joel F. Liebman
LLK - Sharon G. Lias, Rhoda D. Levin, and Sherif A. Kafafi
RDSH - Henry M. Rosenstock, Keith Draxl, Bruce W. Steiner, and John T. Herron
Quantity | Value | Units | Method | Reference | Comment |
---|---|---|---|---|---|
IE (evaluated) | 8.55 ± 0.01 | eV | N/A | N/A | L |
Quantity | Value | Units | Method | Reference | Comment |
Proton affinity (review) | 846.5 | kJ/mol | N/A | Hunter and Lias, 1998 | HL |
Quantity | Value | Units | Method | Reference | Comment |
Gas basicity | 815.3 | kJ/mol | N/A | Hunter and Lias, 1998 | HL |
Ionization energy determinations
IE (eV) | Method | Reference | Comment |
---|---|---|---|
8.46 | CTS | Aloisi, Santini, et al., 1974 | LLK |
8.5 ± 0.1 | EI | Keyes and Harrson, 1968 | RDSH |
8.55 ± 0.01 | PI | Watanabe, Nakayama, et al., 1962 | RDSH |
10.96 | EI | Vorob'ev, Furlei, et al., 1989 | Vertical value; LL |
8.54 | PE | Aue and Bowers, 1979 | Vertical value; LLK |
Appearance energy determinations
Ion | AE (eV) | Other Products | Method | Reference | Comment |
---|---|---|---|---|---|
CHS+ | 15.9 ± 0.4 | ? | EI | Hobrock and Kiser, 1962 | RDSH |
CH2S+ | 13.6 ± 0.3 | ? | EI | Hobrock and Kiser, 1962 | RDSH |
CH3+ | 17.6 ± 0.5 | ? | EI | Hobrock and Kiser, 1962 | RDSH |
CH3S+ | 14.7 ± 0.2 | ? | EI | Hobrock and Kiser, 1962 | RDSH |
CH4S+ | 10.4 ± 0.1 | ? | EI | Keyes and Harrson, 1968 | RDSH |
CH5S+ | 10.7 ± 0.3 | ? | EI | Keyes and Harrson, 1968 | RDSH |
C2H2+ | 17.8 ± 0.5 | ? | EI | Hobrock and Kiser, 1962 | RDSH |
C2H3+ | 16.0 ± 0.4 | ? | EI | Hobrock and Kiser, 1962 | RDSH |
C2H3S+ | 13.4 ± 0.4 | ? | EI | Hobrock and Kiser, 1962 | RDSH |
C2H5+ | 14.1 ± 0.2 | ? | EI | Hobrock and Kiser, 1962 | RDSH |
C2H5S+ | 10.74 | CH3 | EI | Keyes and Harrson, 1968 | RDSH |

Ion clustering data

Data compiled by: Michael M. Meot-Ner (Mautner) and Sharon G. Lias
Clustering reactions
By formula: C3H9S+ + C3H8S = (C3H9S+ • C3H8S)
Quantity | Value | Units | Method | Reference | Comment |
---|---|---|---|---|---|
ΔrH° | 111. | kJ/mol | PHPMS | Meot-Ner (Mautner) and Sieck, 1985 | gas phase; ΔrH?, incosistent with other sulfur compound dimers |
Quantity | Value | Units | Method | Reference | Comment |
ΔrS° | 116. | J/mol*K | PHPMS | Meot-Ner (Mautner) and Sieck, 1985 | gas phase; ΔrH?, incosistent with other sulfur compound dimers |

Kovats' RI, non-polar column, isothermal

Column type | Active phase | Temperature (C) | I | Reference | Comment |
---|---|---|---|---|---|
Capillary | DB-5 | 100. | 625.0 | Miller and Bruno, 2003 | 30. m/0.25 mm/0.1 μm |
Capillary | DB-5 | 120. | 638.2 | Miller and Bruno, 2003 | 30. m/0.25 mm/0.1 μm |
Capillary | DB-5 | 60. | 618.8 | Miller and Bruno, 2003 | 30. m/0.25 mm/0.1 μm |
Capillary | DB-5 | 80. | 621.9 | Miller and Bruno, 2003 | 30. m/0.25 mm/0.1 μm |
Packed | Apiezon M | 130. | 616. | Garbuzov, Misharina, et al., 1985 | He or N2, Chromosorb W, AW-DMCS; Column length: 2.1 m |
Packed | Apiezon M | 60. | 608. | Mikhailova, Gren, et al., 1985 | Chromosorb WAW; Column length: 2.1 m |
Packed | Apiezon M | 130. | 616. | Golovnya, Garbuzov, et al., 1976 | N2, Chromosorb W; Column length: 2.1 m |
Packed | Apiezon L | 130. | 623. | Martinu and Janák, 1970 |

Kovats' RI, polar column, isothermal

Column type | Active phase | Temperature (C) | I | Reference | Comment |
---|---|---|---|---|---|
Packed | Polyethylene Glycol | 130. | 859. | Golovnya, Garbuzov, et al., 1976 | N2, Chromosorb W; Column length: 2.1 m |

Van Den Dool and Kratz RI, non-polar column, custom temperature program

Column type | Active phase | I | Reference | Comment |
---|---|---|---|---|
Capillary | DB-5 | 609. | Klesk and Qian, 2003 | 30. m/0.25 mm/0.25 μm, He; Program: 40C(2min) => 5C/min => 100C => 4C/min => 230C(10min) |
Capillary | HP-5 | 609. | Engel, Baty, et al., 2002 | 30. m/0.25 mm/0.25 μm, He; Program: 5C(5min) => 3C/min => 20C => 5C/min => 100C 15C/min => 150C (5min) |

Van Den Dool and Kratz RI, polar column, temperature ramp

Column type | Active phase | I | Reference | Comment |
---|---|---|---|---|
Capillary | DB-Wax | 829. | Shimoda, Peralta, et al., 1996 | 60. m/0.25 mm/0.25 μm, He, 3. K/min; Tstart: 50. C; Tend: 230. C |

Normal alkane RI, non-polar column, isothermal

Column type | Active phase | Temperature (C) | I | Reference | Comment |
---|---|---|---|---|---|
Capillary | Polydimethyl siloxane with 5 % Ph groups | 100. | 625. | Safa and Hadjmohannadi, 2005 | 30. m/0.25 mm/0.10 μm, Nitrogen |
Capillary | Polydimethyl siloxane with 5 % Ph groups | 60. | 619. | Safa and Hadjmohannadi, 2005 | 30. m/0.25 mm/0.10 μm, Nitrogen |
Capillary | Polydimethyl siloxane with 5 % Ph groups | 80. | 622. | Safa and Hadjmohannadi, 2005 | 30. m/0.25 mm/0.10 μm, Nitrogen |

Normal alkane RI, non-polar column, temperature ramp

Column type | Active phase | I | Reference | Comment |
---|---|---|---|---|
Capillary | PONA | 620. | Yang, Wang, et al., 2003 | 50. m/0.20 mm/0.50 μm, 2. K/min; Tstart: 30. C; Tend: 150. C |
Capillary | PONA | 610. | Yang, Yang, et al., 2003 | 50. m/0.20 mm/0.50 μm, Helium, 2. K/min; Tstart: 30. C; Tend: 170. C |

Normal alkane RI, non-polar column, custom temperature program

Column type | Active phase | I | Reference | Comment |
---|---|---|---|---|
Capillary | SPB-5 | 614. | Begnaud, Pérès, et al., 2003 | 60. m/0.32 mm/1. μm; Program: not specified |
Capillary | PONA | 622. | Yang, Wang, et al., 2003 | 50. m/0.20 mm/0.50 μm; Program: not specified |
Capillary | CP Sil 5 CB | 611. | Gijs, Piraprez, et al., 2000 | 50. m/0.32 mm/1.2 μm, He; Program: 33C (16.5min) => 2C/min => 160C => 20C/min => 200C (9min) |
Capillary | Polydimethyl siloxanes | 605. | Zenkevich, 1998 | Program: not specified |
Capillary | SE-52 | 617. | van Langenhove and Schamp, 1986 | Column length: 100. m; Column diameter: 0.50 mm; Program: not specified |

Normal alkane RI, polar column, temperature ramp

Column type | Active phase | I | Reference | Comment |
---|---|---|---|---|
Capillary | Supelcowax-10 | 859. | Girard and Durance, 2000 | 60. m/0.25 mm/0.25 μm, He, 35. C @ 10. min, 4. K/min; Tend: 200. C |

References

Hubbard and Waddington, 1954
Hubbard, W.N.; Waddington, G.,
The heat of combustion, formation and isomerization of propanethiol-1, propane-thiol-2 and 2-thiabutane,
Rec. Trav. Chim. Pays/Bas, 1954, 73, 910. [all data]
Weast and Grasselli, 1989
CRC Handbook of Data on Organic Compounds, 2nd Editon, Weast,R.C and Grasselli, J.G., ed(s)., CRC Press, Inc., Boca Raton, FL, 1989, 1. [all data]
Majer and Svoboda, 1985
Majer, V.; Svoboda, V.,
Enthalpies of Vaporization of Organic Compounds: A Critical Review and Data Compilation, Blackwell Scientific Publications, Oxford, 1985, 300. [all data]
Pochinok and Limarenko, 1955
Pochinok, Ya.; Limarenko, A.P.,
Alkylation of Mercaptans with Alkylaryltriazines,
Ukrain. Khim. Zh., 1955, 21, 628-30. [all data]
Mcallan, Cullum, et al., 1951
Mcallan, D.T.; Cullum, T.V.; Dean, R.A.; Fidler, F.A.,
The Preparation and Properties of Sulfur Compounds Related to Petroleum I. The Dialkyl Sulfides and Disulfides,
J. Am. Chem. Soc., 1951, 73, 3627-32. [all data]
Trotter and Thompson, 1946
Trotter, I.F.; Thompson, H.W.,
Infrared SPectra of Thiols, Sulfides, and Disulfides,
J. Chem. Soc., 1946, 1946, 481. [all data]
Scott, Finke, et al., 1951
Scott, D.W.; Finke, H.L.; McCullough, J.P.; Gross, M.E.; Williamson, K.D.; Waddington, G.; Huffman, H.M.,
Thermodynamic Properties and Rotational Isomerism of 2-Thiabutane,
J. Am. Chem. Soc., 1951, 73, 261-5. [all data]
Shimizu, Saito, et al., 1981
Shimizu, M.; Saito, Y.; Kusano, K.,
, Preprints 17th Conf. Chem. Thermodyn. Thermal Anal., Japan, 1981, 50. [all data]
Reid, 1972
Reid, Robert C.,
Handbook on vapor pressure and heats of vaporization of hydrocarbons and related compounds, R. C. Wilhort and B. J. Zwolinski, Texas A Research Foundation. College Station, Texas(1971). 329 pages.$10.00,
AIChE J., 1972, 18, 6, 1278-1278, https://doi.org/10.1002/aic.690180637
. [all data]
Osborn and Douslin, 1966
Osborn, A.G.; Douslin, D.R.,
Vapor Pressure Relations of 36 Sulfur Compounds Present in Petroleum.,
J. Chem. Eng. Data, 1966, 11, 4, 502-509, https://doi.org/10.1021/je60031a014
. [all data]
Hubbard and Waddington, 2010
Hubbard, Ward N.; Waddington, Guy,
The heats of combustion, formation and isomerization of propanethiol-1, propane-thiol-2 and 2-thiabutane,
Recl. Trav. Chim. Pays-Bas, 2010, 73, 11, 910-923, https://doi.org/10.1002/recl.19540731107
. [all data]
Dykyj, Svoboda, et al., 1999
Dykyj, J.; Svoboda, J.; Wilhoit, R.C.; Frenkel, M.L.; Hall, K.R.,
Vapor Pressure of Chemicals: Part A. Vapor Pressure and Antoine Constants for Hydrocarbons and Sulfur, Selenium, Tellurium and Hydrogen Containing Organic Compounds, Springer, Berlin, 1999, 373. [all data]
Stephenson and Malanowski, 1987
Stephenson, Richard M.; Malanowski, Stanislaw,
Handbook of the Thermodynamics of Organic Compounds, 1987, https://doi.org/10.1007/978-94-009-3173-2
. [all data]
Scott, Finke, et al., 1951, 2
Scott, D.W.; Finke, H.L.; McCullough, J.P.; Gross, M.E.; Williamson, K.D.; Waddington, G.; Huffman, H.M.,
Thermodynamic properties and rotational isomerism of 2-thiabutane,
J. Am. Chem. Soc., 1951, 73, 261-265. [all data]
Mackle, Mayrick, et al., 1960
Mackle, H.; Mayrick, R.G.; Rooney, J.J.,
Measurement of heats of vaporization by the method of gas-liquid chromatography,
Trans. Faraday Soc., 1960, 56, 115, https://doi.org/10.1039/tf9605600115
. [all data]
Thompson and Linnett, 1935
Thompson, H.W.; Linnett, J.W.,
The vapour pressures of some alkyl sulphides,
Trans. Faraday Soc., 1935, 31, 1743, https://doi.org/10.1039/tf9353101743
. [all data]
Domalski and Hearing, 1996
Domalski, Eugene S.; Hearing, Elizabeth D.,
Heat Capacities and Entropies of Organic Compounds in the Condensed Phase. Volume III,
J. Phys. Chem. Ref. Data, 1996, 25, 1, 1, https://doi.org/10.1063/1.555985
. [all data]
Meot-Ner (Mautner) and Sieck, 1985
Meot-Ner (Mautner), M.; Sieck, L.W.,
The Ionic Hydrogen Bond and Ion Solvation. 4. SH+ O and NH+ S Bonds. Correlations with Proton Affinity. Mutual Effects of Weak and Strong Ligands in Mixed Clusters,
J. Phys. Chem., 1985, 89, 24, 5222, https://doi.org/10.1021/j100270a021
. [all data]