3-Nonanol
- Formula: C9H20O
- Molecular weight: 144.2545
- IUPAC Standard InChIKey: GYSCXPVAKHVAAY-UHFFFAOYSA-N
- CAS Registry Number: 624-51-1
- Chemical structure:
View 3d structure (requires JavaScript / HTML 5) - Stereoisomers:
- Other names: Hexylethylcarbinol; nonan-3-ol

Kovats' RI, polar column, isothermal

Column type | Active phase | Temperature (C) | I | Reference | Comment |
---|---|---|---|---|---|
Packed | Carbowax 20M | 130. | 1459. | Singliar, 1972 | Column length: 2.55 m |
Packed | Carbowax 20M | 165. | 1461. | Singliar, 1972 | Column length: 2.55 m |

Normal alkane RI, non-polar column, temperature ramp

Column type | Active phase | I | Reference | Comment |
---|---|---|---|---|
Capillary | PE-5 | 1099. | Singh, Raina, et al., 2005 | 30. m/0.32 mm/0.25 μm, H2, 60. C @ 2. min, 5. K/min, 230. C @ 4. min |
Capillary | CP Sil 5 CB | 1069. | Baser, Özek, et al., 2000 | 25. m/0.25 mm/0.4 μm, He, 60. C @ 40. min, 5. K/min; Tend: 260. C |

Normal alkane RI, non-polar column, custom temperature program

Column type | Active phase | I | Reference | Comment |
---|---|---|---|---|
Capillary | AT-5 | 1090. | Usai, Atzei, et al., 2003 | 60. m/0.25 mm/0.25 μm, He; Program: 50 0C 5 0C/min -> 135 0C (1 min) 5 0C/min -> 225 0C (5 min) 5 0C/min -> 260 0C |

Normal alkane RI, polar column, temperature ramp

Column type | Active phase | I | Reference | Comment |
---|---|---|---|---|
Capillary | DB-Wax | 1493. | Werkhoff, Güntert, et al., 1998 | 60. m/0.32 mm/0.25 μm, H2, 3. K/min; Tstart: 60. C; Tend: 220. C |

Normal alkane RI, polar column, custom temperature program

Column type | Active phase | I | Reference | Comment |
---|---|---|---|---|
Capillary | PEG-20M | 1489. | Qin, 2009 | Program: not specified |
Capillary | HP-Innowax | 1496. | Baser, Demirci, et al., 2002 | 60. m/0.25 mm/0.25 μm, He; Program: 60 0C (10 min) 4 K/min -> 220 0C (10 min) 1 K/min -> 240 0C |
Capillary | HP-Innowax | 1496. | Tabanca, Kirimer, et al., 2001 | 60. m/0.25 mm/0.25 μm, He; Program: 60C(10min) => 4C/min => 220C(10min) => 1C/min => 240C |

Phase change data

Data compiled as indicated in comments:
TRC - Thermodynamics Research Center, NIST Boulder Laboratories, Chris Muzny director
AC - William E. Acree, Jr., James S. Chickos
Quantity | Value | Units | Method | Reference | Comment |
---|---|---|---|---|---|
Tboil | 467.9 | K | N/A | Wagner, 1891 | Uncertainty assigned by TRC = 3. K; TRC |
Quantity | Value | Units | Method | Reference | Comment |
Tc | 648. ± 1. | K | N/A | Gude and Teja, 1995 | |
Tc | 648. | K | N/A | Teja, Lee, et al., 1989 | TRC |
Tc | 648. | K | N/A | Anselme and Teja, 1988 | Uncertainty assigned by TRC = 0.3 K; TRC |
Quantity | Value | Units | Method | Reference | Comment |
Vc | 0.577 | l/mol | N/A | Gude and Teja, 1995 | |
Quantity | Value | Units | Method | Reference | Comment |
ρc | 1.73 | mol/l | N/A | Gude and Teja, 1995 | |
ρc | 1.73 | mol/l | N/A | Anselme and Teja, 1988 | Uncertainty assigned by TRC = 0.04 mol/l; TRC |
Quantity | Value | Units | Method | Reference | Comment |
ΔvapH° | 70.9 ± 0.3 | kJ/mol | GS | Verevkin and Schick, 2007 | Based on data from 263. to 363. K.; AC |
Enthalpy of vaporization
ΔvapH (kJ/mol) | Temperature (K) | Reference | Comment |
---|---|---|---|
75.5 | 278. | N'Guimbi, Berro, et al., 1999 | Based on data from 263. to 363. K.; AC |
57.1 | 381. | Wilhoit and Zwolinski, 1973 | Based on data from 366. to 468. K.; AC |

References

Singliar, 1972
Singliar, M.,
Chromatographic Behaviour and the Structure of Secondary Aliphatic Alcohols,
J. Chromatogr., 1972, 65, 1, 311-321, https://doi.org/10.1016/S0021-9673(00)86946-0
. [all data]
Singh, Raina, et al., 2005
Singh, A.K.; Raina, V.K.; Naqvi, A.A.; Patra, N.K.; Kumar, B.; Ram, P.; Khanuja, S.P.S.,
Essential oil composition and chemoarrays of menthol mint (Mentha arvensis L. f. piperascens Malinvaud ex. Holmes) cultivars,
Flavour Fragr. J., 2005, 20, 3, 302-305, https://doi.org/10.1002/ffj.1417
. [all data]
Baser, Özek, et al., 2000
Baser, K.H.C.; Özek, T.; Demirci, B.; Kürkcüoglu, M.; Aytac, Z.; Duman, H.,
Composition of the essential oils of Zosima absinthifolia (Vent.) Link and Ferula elaeochytris Korovin from Turkey,
Flavour Fragr. J., 2000, 15, 6, 371-372, https://doi.org/10.1002/1099-1026(200011/12)15:6<371::AID-FFJ919>3.0.CO;2-Z
. [all data]
Usai, Atzei, et al., 2003
Usai, M.; Atzei, A.; Pintore, G.; Casanova, I.,
Composition and variability of the essential oil of Sardinian Thymus herba-barona Loisel,
Flavour Fragr. J., 2003, 18, 1, 21-25, https://doi.org/10.1002/ffj.1137
. [all data]
Werkhoff, Güntert, et al., 1998
Werkhoff, P.; Güntert, M.; Krammer, G.; Sommer, H.; Kaulen, J.,
Vacuum headspace method in aroma research: flavor chemistry of yellow passion fruits,
J. Agric. Food Chem., 1998, 46, 3, 1076-1093, https://doi.org/10.1021/jf970655s
. [all data]
Qin, 2009
Qin, Z.,
Relationship between the molecular structure and gas chromatographic retention index of alcohol isomer,
J. Xuzhou Norm. Univ. (Nat. Sci. Edn.), 2009, 27, 2, 88-90. [all data]
Baser, Demirci, et al., 2002
Baser, K.H.C.; Demirci, B.; Kirimer, N.; Satil, F.; Tumen, G.,
The essential oils of Thymus migricus and T. fedtschenkoi var. handelii from Turkey,
Flavour Fragr. J., 2002, 17, 1, 41-45, https://doi.org/10.1002/ffj.1036
. [all data]
Tabanca, Kirimer, et al., 2001
Tabanca, N.; Kirimer, N.; Demirci, B.; Demirci, F.; Can Baser, K.H.,
Composition and antimicrobial activity of the essential oils of Micromeria cristata subsp. phrygia and the enantiomeric distribution of borneol,
J. Agric. Food Chem., 2001, 49, 9, 4300-4303, https://doi.org/10.1021/jf0105034
. [all data]