Alpha-monopropionin
- Formula: C6H12O4
- Molecular weight: 148.1571
- IUPAC Standard InChIKey: AALUCPRYHRPMAG-UHFFFAOYSA-N
- CAS Registry Number: 624-47-5
- Chemical structure:

Phase change data

Data compiled by: William E. Acree, Jr., James S. Chickos
Enthalpy of vaporization
ΔvapH (kJ/mol) | Temperature (K) | Method | Reference | Comment |
---|---|---|---|---|
75.8 | 403. | A | Stephenson and Malanowski, 1987 | Based on data from 388. to 456. K. See also Dykyj, 1972. |

References

Stephenson and Malanowski, 1987
Stephenson, Richard M.; Malanowski, Stanislaw,
Handbook of the Thermodynamics of Organic Compounds, 1987, https://doi.org/10.1007/978-94-009-3173-2
. [all data]
Dykyj, 1972
Dykyj, J.,
Petrochemia, 1972, 12, 1, 13. [all data]